{
  "name": "adullact-directmairie",
  "version": "2.1.0",
  "author": "adullact",
  "summary": "Install DirectMairie application",
  "license": "AGPL-3.0-or-later",
  "source": "https://gitlab.adullact.net/directmairie/puppet-directmairie",
  "dependencies": [
    {
      "name": "puppet/archive",
      "version_requirement": ">= 4.0.0 < 5.0.0"
    },
    {
      "name": "puppetlabs/postgresql",
      "version_requirement": ">= 6.1.0 < 7.0.0"
    },
    {
      "name": "puppetlabs/stdlib",
      "version_requirement": ">= 4.17.0 < 7.0.0"
    }
  ],
  "operatingsystem_support": [
    {
      "operatingsystem": "Ubuntu",
      "operatingsystemrelease": [
        "16.04"
      ]
    }
  ],
  "requirements": [
    {
      "name": "puppet",
      "version_requirement": ">= 4.10.0 < 7.0.0"
    }
  ],
  "pdk-version": "1.10.0",
  "template-url": "file:///opt/puppetlabs/pdk/share/cache/pdk-templates.git#1.10.0",
  "template-ref": "1.10.0-0-gbba9ac3"
}
