{
  "id_type_dossier": "draft-ls-mailsec-bidir-reponse",
  "pastell-version": "%VERSION%",
  "timestamp": 1704450010,
  "raw_data": {
    "id_type_dossier": "draft-ls-mailsec-bidir-reponse",
    "nom": "Mail s\u00e9curis\u00e9 avec r\u00e9ponse (r\u00e9ponse)",
    "type": "Mails s\u00e9curis\u00e9s",
    "description": "R\u00e9ponses des destinataires de Mail s\u00e9curis\u00e9 avec r\u00e9ponse",
    "nom_onglet": "R\u00e9ponse",
    "affiche_one": false,
    "restriction_pack": "",
    "formulaireElement": [
      {
        "element_id": "reponse",
        "name": "R\u00e9ponse",
        "type": "textarea",
        "commentaire": "",
        "requis": "on",
        "champs_affiches": "",
        "champs_recherche_avancee": "",
        "titre": "",
        "select_value": "",
        "preg_match": "",
        "default_value": "",
        "preg_match_error": "",
        "content_type": ""
      },
      {
        "element_id": "document_attache",
        "name": "Document(s)",
        "type": "multi_file",
        "commentaire": "",
        "requis": "",
        "champs_affiches": "",
        "champs_recherche_avancee": "",
        "titre": "",
        "select_value": "",
        "preg_match": "",
        "default_value": "",
        "preg_match_error": "",
        "content_type": ""
      }
    ],
    "etape": []
  }
}