{
  "x": 400,
  "y": 0,
  "page": 1,
  "width": 200,
  "height": 70,
  "elements": [
    {
      "type": "IMAGE",
      "x": 33,
      "y": 17,
      "width": 25,
      "height": 25,
      "value": "iVBORw0KGgoAAAANSUhEUgAAAHEAAABQCAYAAAAujppDAAAACXBIWXMAAAsSAAALEgHS3X78AAAFk0lEQVR4nO2dX1LbMBDGF6bvpScgNyA9AelzPQM+AekJ4CXPhNf6gdyAcALTmbyTnKDkBE1uACegI\/jEiJAY21rJK41+MxkyEGTJn1d\/dlfK3vPzM7Uhy4s+ER3g1UcR5vtdzPH7ByJazcrRQ6sKdEiWFwOjrZvtP6qo2ZKIHvFe3YeVug+296BSxCwvekSkXgP87KHCX5lv4QKNupMkKtrfx2vgqO2aP6r9uAeP9f7llXci4gkbeKhwFWsimhLRpGljOMA9GOIeHPq+PrglovGsHK3qfHjv5+nvHm7asY\/aNaRRYzjI8kJZw4mg9l989jDvo4uUKKDijIj+ZXkxzvLiwNM1JY3Rqv2rLC9Oqz60768+Vlyqm4vJlGu8WX1N1JBWqgd518dDEZEwPv3N8uLC8XWkiai53CVkSCJqrrO8mLoqfFaO5jU+1hVKyOHmtUMUUXHmUkjMkKUywdLnjVBFJAg5cVS21C6VMEa+e4BDFlFxvq17YUC6F+kY69kXQhdR8aF7YUCyJWreJngxiPihe2EgBH\/uiV47xyAioXvh7FbbiriEH1i\/nhjrtI0XJ8AXpsLW2iNveOkJ7x\/hFSLHPtkxl0UqN1eWF9v+tDDaOKeaSxJ09wPcdE6XnipzyiXisMn6ClYzZHb3HapyZ+WIq2tdILSkfKlzm\/UjfL+qXlMIOmES82Vyoxzg6s29ZWE\/2jQS3pcxo2WuZ+WIe5LjBKxzzxjK\/tbpmDgrRxM8TVxjx6En\/6o1s3I0hLXb0u98YoMg8KDGR+vi2rfKCUddeyJmpxDyiqk4zgfCKWj30vIaMkSk1waNmXyWwXSp4M62AGnrxJ0xs4YEY41G4lhb5FgivVrjlMkaQ7JEW3pc60ROVPdyblmeNxE30hepIm3TdISsDOeINbGKWJX72RrD86I9T02us8uxYb28Euc75Yqsc0Y2lCcoywtVr39EdINFOteDYu3okGiJhGm37U3q2YaU4B4cd5h\/WgupInpPGjbBODeVLp5Gaiiqs3ge\/Ln3oQhIkVti42RjRqe0V2IJCm+j0TIDFhicgBS5iLW7ZIyB126r446YRazVJSNPxWUOq3NiFrEuFyFNYrYhdWLj04HtIm91bbjWtq1VdftY8o2kisjBp90ptoxxWeEajoF5k\/2UGI+t0mOkimidQFVz2ziXxV8hHtoJ4sZEpoBu3XAWx7U6FZCETmw4rKNud2Zr8euuBSShInJMNHztMRSxNBElIgZ5jhCPL9+riD0bsebY+LLETqMtGjEiwnfJkda\/9Hj+jYiELBEiIvjK5bv0OU6JSMjiEnFs7lxtAizwhqkexJHH2YATCTmuXIt91Q3eZ3mxhCXMqxbbcDqfOkh9WDQ8fYojDUTtdBp0cYSZhttjc6S7Rezv0xtG9I3t1TiJ0IamXemKoS5HOPVp0tV5dK7dbscbP12ybrE3cc60T\/ArTr1S58x82Ii6Qc\/YdEt6t68NMTnA2yxP7hwEg4+Nh\/eSueytxBJPXLTZIYzx03ZXUufEIOKTpavO1YFG3ohBxAub81BhwUFbY+gi3jIdtOAiuu+NkEW8xb53a7Cm\/dVtc9oTqohsAmpg0becZfoiRBGvuAXUoNzgLDIkEdc4L8dpJB0W+T2kyU4IIj7hZI2+r1OB1Rg5K0d9WKXkA2zVvXngOlHqF8Iy3CmAnX0\/hglCZdznsjVF57LO4dZ70Esr9mPBEJo5bXkYn8hvqtEg+mJu93Zx2ODS8Luu8FVMlT2Q87Pd0HAdc+tvbDnT\/7Py+QUm3Bix1M32VWEexPBo89B2ekBfgoe0oSYCkogRkESMgCRiBCQRIyCJGAFJxAhIIkZAEjECkogRkESMgCRiBCQRIyCJGAFJxAhIIkZAEjECviCPw\/Z7moJNrQgeIvoPjyjI8vUigd4AAAAASUVORK5CYII="
    },
    {
      "type": "TEXT",
      "x": 70,
      "y": 14,
      "colorCode": "#000000",
      "font": "HELVETICA_BOLD",
      "fontSize": 8,
      "value": "The user\n19\/10\/2021"
    },
    {
      "type": "IMAGE",
      "x": 62,
      "y": 12,
      "width": 2,
      "height": 24,
      "value": "iVBORw0KGgoAAAANSUhEUgAAAAgAAADJCAYAAAAeu3OaAAAACXBIWXMAAAsSAAALEgHS3X78AAAAUklEQVRYhe3ZMRGDUABEwQeDAKTgAAFpYomWComRwtDnV7R77VsHN32+51ZdDbZUa7WPwDwKAAAAAAAAAAAAAAAAAAAAAAAAwAvw3DS\/6vhbqxvRTAUrFl4H9QAAAABJRU5ErkJggg=="
    }
  ]
}
