{
  "id_type_dossier": "draft-ls-mailsec-bidir",
  "pastell-version": "%VERSION%",
  "timestamp": 1704450007,
  "raw_data": {
    "id_type_dossier": "draft-ls-mailsec-bidir",
    "nom": "Mail s\u00e9curis\u00e9 avec r\u00e9ponse",
    "type": "Mails s\u00e9curis\u00e9s",
    "description": "Type de dossier permettant d'envoyer des mail s\u00e9curis\u00e9s et de r\u00e9cup\u00e9rer des r\u00e9ponses des destinataires",
    "nom_onglet": "Dossier",
    "affiche_one": true,
    "restriction_pack": "",
    "formulaireElement": [
      {
        "element_id": "objet",
        "name": "Objet",
        "type": "text",
        "commentaire": "",
        "requis": "on",
        "champs_affiches": "",
        "champs_recherche_avancee": "",
        "titre": "on",
        "select_value": "",
        "preg_match": "",
        "default_value": "",
        "preg_match_error": "",
        "content_type": ""
      },
      {
        "element_id": "message",
        "name": "Message",
        "type": "textarea",
        "commentaire": "",
        "requis": "",
        "champs_affiches": "",
        "champs_recherche_avancee": "",
        "titre": false,
        "select_value": "",
        "preg_match": "",
        "default_value": "",
        "preg_match_error": "",
        "content_type": ""
      },
      {
        "element_id": "document_attache",
        "name": "Document(s)",
        "type": "multi_file",
        "commentaire": "",
        "requis": "",
        "champs_affiches": "",
        "champs_recherche_avancee": "",
        "titre": "",
        "select_value": "",
        "preg_match": "",
        "default_value": "",
        "preg_match_error": "",
        "content_type": ""
      },
      {
        "element_id": "metadonnees",
        "name": "Fichier contenant les m\u00e9tadonn\u00e9es",
        "type": "file",
        "commentaire": "Pr\u00e9f\u00e9rentiellement au format JSON, XML possible",
        "requis": "",
        "champs_affiches": "",
        "champs_recherche_avancee": "",
        "titre": false,
        "select_value": "",
        "preg_match": "",
        "default_value": "",
        "preg_match_error": "",
        "content_type": ""
      }
    ],
    "etape": [
      {
        "num_etape": 0,
        "type": "transformation",
        "label": "Transformation",
        "defaultChecked": false,
        "requis": "on",
        "automatique": "on",
        "specific_type_info": [],
        "num_etape_same_type": 0,
        "etape_with_same_type_exists": false
      },
      {
        "num_etape": 1,
        "type": "mailsec",
        "label": "",
        "defaultChecked": true,
        "requis": "on",
        "automatique": "on",
        "specific_type_info": [],
        "num_etape_same_type": 0,
        "etape_with_same_type_exists": false
      }
    ]
  }
}