{
  "realm": "pastell",
  "notBefore": 0,
  "revokeRefreshToken": false,
  "refreshTokenMaxReuse": 0,
  "accessTokenLifespan": 300,
  "accessTokenLifespanForImplicitFlow": 900,
  "ssoSessionIdleTimeout": 1800,
  "ssoSessionMaxLifespan": 36000,
  "offlineSessionIdleTimeout": 2592000,
  "offlineSessionMaxLifespanEnabled": false,
  "offlineSessionMaxLifespan": 5184000,
  "accessCodeLifespan": 60,
  "accessCodeLifespanUserAction": 300,
  "accessCodeLifespanLogin": 1800,
  "actionTokenGeneratedByAdminLifespan": 43200,
  "actionTokenGeneratedByUserLifespan": 300,
  "enabled": true,
  "sslRequired": "external",
  "registrationAllowed": false,
  "registrationEmailAsUsername": false,
  "rememberMe": false,
  "verifyEmail": false,
  "loginWithEmailAllowed": false,
  "duplicateEmailsAllowed": false,
  "resetPasswordAllowed": true,
  "editUsernameAllowed": false,
  "bruteForceProtected": false,
  "permanentLockout": false,
  "maxFailureWaitSeconds": 900,
  "minimumQuickLoginWaitSeconds": 60,
  "waitIncrementSeconds": 60,
  "quickLoginCheckMilliSeconds": 1000,
  "maxDeltaTimeSeconds": 43200,
  "failureFactor": 30,
  "internationalizationEnabled": true,
  "supportedLocales": [
    "fr"
  ],
  "defaultLocale": "fr",
  "loginTheme": "keycloak",
  "smtpServer": {
    "host": "mail",
    "from": "test@libriciel.net",
    "starttls": "",
    "auth": "",
    "ssl": ""
  },
  "roles": {
    "realm": [
      {
        "name": "user",
        "description": "User privileges",
        "composite": false,
        "clientRole": false
      },
      {
        "name": "admin",
        "description": "Administrator privileges",
        "composite": false,
        "clientRole": false
      }
    ],
    "client": {
      "api-client": [
        {
          "name": "admin-api",
          "description": "un role pour le client api seulemement",
          "clientRole": true,
          "composite": true,
          "composites": {
            "client": {
              "realm-management": [
                "realm-admin"
              ]
            }
          }
        }
      ]
    }
  },
  "scopeMappings": [
    {
      "client": "web-client",
      "roles": [
        "user"
      ]
    }
  ],
  "clientScopeMappings": {
    "account": [
      {
        "client": "web-client",
        "roles": [
          "view-profile"
        ]
      }
    ]
  },
  "groups": [
    {
      "name": "adminGroup",
      "path": "/adminGroup",
      "attributes": {},
      "realmRoles": [],
      "clientRoles": {
        "api-client": [
          "admin-api"
        ]
      },
      "subGroups": []
    },
    {
      "name": "simpleUser",
      "path": "/simpleUser",
      "attributes": {},
      "realmRoles": [],
      "clientRoles": {},
      "subGroups": []
    }
  ],
  "users": [
    {
      "username": "falseUser",
      "enabled": true,
      "email": "sample-user@example",
      "firstName": "Sample",
      "lastName": "User",
      "credentials": [
        {
          "type": "password",
          "value": "Aqwxsz123!er"
        }
      ],
      "groups": [
        "adminGroup"
      ],
      "realmRoles": [
        "user"
      ],
      "clientRoles": {
        "account": [
          "view-profile",
          "manage-account"
        ]
      }
    },
    {
      "id" : "4882bade-72bb-40d8-b896-36a6dd03bbd9",
      "username": "user",
      "enabled": true,
      "email": "sebastien.blanc@test.fr",
      "firstName": "Sébastien",
      "lastName": "Blanc",
      "credentials": [
        {
          "type": "password",
          "value": "user"
        }
      ],
      "groups": [
        "adminGroup"
      ],
      "realmRoles": [
        "user"
      ],
      "clientRoles": {
        "account": [
          "view-profile",
          "manage-account"
        ]
      }
    },
    {
      "id": "18c45a75-2852-4637-8e78-6ff3ed949164",
      "username": "user1",
      "enabled": true,
      "email": "mickael.vert@test.fr ",
      "firstName": "Mickael",
      "lastName": "Vert",
      "credentials": [
        {
          "type": "password",
          "value": "user1"
        }
      ],
      "groups": [
        "simpleUser"
      ],
      "realmRoles": [
        "user"
      ],
      "clientRoles": {
        "account": [
          "view-profile",
          "manage-account"
        ]
      }
    },
    {
      "id": "684dd96c-cdfd-4304-8869-b1567f9c5286",
      "username": "user2",
      "enabled": true,
      "email": "julien.orange@test.fr",
      "firstName": "Julien",
      "lastName": "Orange",
      "credentials": [
        {
          "type": "password",
          "value": "user2"
        }
      ],
      "groups": [
        "simpleUser"
      ],
      "realmRoles": [
        "user"
      ],
      "clientRoles": {
        "account": [
          "view-profile",
          "manage-account"
        ]
      }
    },
    {
      "id": "c8832f5d-4f54-4e95-9714-8715b734c514",
      "username": "user3",
      "enabled": true,
      "email": "remi.violet@test.fr",
      "firstName": "Rémi",
      "lastName": "Violet",
      "credentials": [
        {
          "type": "password",
          "value": "user3"
        }
      ],
      "groups": [
        "simpleUser"
      ],
      "realmRoles": [
        "user"
      ],
      "clientRoles": {
        "account": [
          "view-profile",
          "manage-account"
        ]
      }
    },
    {
      "id": "cc17649d-254c-4d63-97ca-eb1b4a69b6a0",
      "username": "admin",
      "enabled": true,
      "email": "admin@admin.admin",
      "firstName": "Firstname admin",
      "lastName": "Lastname admin",
      "credentials": [
        {
          "type": "password",
          "value": "admin"
        }
      ],
      "groups": [
        "simpleUser"
      ],
      "realmRoles": [
        "user"
      ],
      "clientRoles": {
        "account": [
          "view-profile",
          "manage-account"
        ]
      }
    }
  ],
  "clients": [
    {
      "clientId": "account",
      "name": "${client_account}",
      "baseUrl": "/auth/realms/pastell/account",
      "surrogateAuthRequired": false,
      "enabled": true,
      "clientAuthenticatorType": "client-secret",
      "secret": "132ff39b-eedd-4fa6-993d-a3ffe63b6b0b",
      "defaultRoles": [
        "manage-account",
        "view-profile"
      ],
      "redirectUris": [
        "/auth/realms/pastell/account/*",
        "https://127.0.0.1:8443",
        "https://127.0.0.1:8443/Connexion/oidc"
      ],
      "webOrigins": [],
      "notBefore": 0,
      "bearerOnly": false,
      "consentRequired": false,
      "standardFlowEnabled": true,
      "implicitFlowEnabled": false,
      "directAccessGrantsEnabled": false,
      "serviceAccountsEnabled": false,
      "publicClient": false,
      "frontchannelLogout": false,
      "protocol": "openid-connect",
      "attributes": {
        "saml.assertion.signature": "false",
        "saml.force.post.binding": "false",
        "saml.multivalued.roles": "false",
        "saml.encrypt": "false",
        "saml.server.signature": "false",
        "saml.server.signature.keyinfo.ext": "false",
        "exclude.session.state.from.auth.response": "false",
        "saml_force_name_id_format": "false",
        "saml.client.signature": "false",
        "tls.client.certificate.bound.access.tokens": "false",
        "saml.authnstatement": "false",
        "display.on.consent.screen": "false",
        "saml.onetimeuse.condition": "false"
      },
      "authenticationFlowBindingOverrides": {},
      "fullScopeAllowed": false,
      "nodeReRegistrationTimeout": 0,
      "defaultClientScopes": [
        "role_list",
        "profile",
        "email"
      ],
      "optionalClientScopes": [
        "address",
        "phone",
        "offline_access"
      ]
    },
    {
      "clientId": "web-client",
      "baseUrl": "",
      "surrogateAuthRequired": false,
      "enabled": true,
      "clientAuthenticatorType": "client-secret",
      "redirectUris": [
        "/*"
      ],
      "webOrigins": [],
      "notBefore": 0,
      "bearerOnly": false,
      "consentRequired": false,
      "standardFlowEnabled": true,
      "implicitFlowEnabled": false,
      "directAccessGrantsEnabled": true,
      "serviceAccountsEnabled": false,
      "publicClient": true,
      "frontchannelLogout": false,
      "protocol": "openid-connect",
      "attributes": {
        "saml.assertion.signature": "false",
        "saml.force.post.binding": "false",
        "saml.multivalued.roles": "false",
        "saml.encrypt": "false",
        "saml.server.signature": "false",
        "saml.server.signature.keyinfo.ext": "false",
        "exclude.session.state.from.auth.response": "false",
        "saml_force_name_id_format": "false",
        "saml.client.signature": "false",
        "tls.client.certificate.bound.access.tokens": "false",
        "saml.authnstatement": "false",
        "display.on.consent.screen": "false",
        "saml.onetimeuse.condition": "false"
      },
      "authenticationFlowBindingOverrides": {},
      "fullScopeAllowed": true,
      "nodeReRegistrationTimeout": -1,
      "defaultClientScopes": [
        "role_list",
        "profile",
        "email"
      ],
      "optionalClientScopes": [
        "address",
        "phone",
        "offline_access"
      ]
    },
    {
      "clientId": "api-client",
      "secret": "4586d80a-f2b1-4c2d-b1e4-cb6558809177",
      "surrogateAuthRequired": false,
      "enabled": true,
      "redirectUris": [],
      "webOrigins": [],
      "notBefore": 0,
      "bearerOnly": true,
      "consentRequired": false,
      "standardFlowEnabled": true,
      "implicitFlowEnabled": false,
      "directAccessGrantsEnabled": true,
      "serviceAccountsEnabled": false,
      "publicClient": false,
      "frontchannelLogout": false,
      "protocol": "openid-connect",
      "attributes": {
        "saml.assertion.signature": "false",
        "saml.force.post.binding": "false",
        "saml.multivalued.roles": "false",
        "saml.encrypt": "false",
        "saml.server.signature": "false",
        "saml.server.signature.keyinfo.ext": "false",
        "exclude.session.state.from.auth.response": "false",
        "saml_force_name_id_format": "false",
        "saml.client.signature": "false",
        "tls.client.certificate.bound.access.tokens": "false",
        "saml.authnstatement": "false",
        "display.on.consent.screen": "false",
        "saml.onetimeuse.condition": "false"
      },
      "authenticationFlowBindingOverrides": {},
      "fullScopeAllowed": true,
      "nodeReRegistrationTimeout": -1,
      "defaultClientScopes": [
        "role_list",
        "profile",
        "email"
      ],
      "optionalClientScopes": [
        "address",
        "phone",
        "offline_access"
      ]
    }
  ]
}
