{
  "id_type_dossier": "document-autorisation-urba-destinataire-draft",
  "pastell-version": "3.1.5",
  "timestamp": 1633501535,
  "raw_data": {
    "id_type_dossier": "document-autorisation-urba-destinataire-draft",
    "nom": "document-autorisation-urbanisme-destinataire-draft",
    "type": "Urbanisme",
    "description": "",
    "nom_onglet": "onglet1",
    "formulaireElement": [
      {
        "element_id": "titre",
        "name": "Titre",
        "type": "text",
        "commentaire": "",
        "requis": "",
        "champs_affiches": "",
        "champs_recherche_avancee": "",
        "titre": "",
        "select_value": "",
        "preg_match": "",
        "preg_match_error": ""
      },
      {
        "element_id": "document",
        "name": "Document",
        "type": "file",
        "commentaire": "",
        "requis": "",
        "champs_affiches": "",
        "champs_recherche_avancee": "",
        "titre": "",
        "select_value": "",
        "preg_match": "",
        "preg_match_error": ""
      },
      {
        "element_id": "annexe",
        "name": "Annexe(s)",
        "type": "multi_file",
        "commentaire": "",
        "requis": "",
        "champs_affiches": "",
        "champs_recherche_avancee": "",
        "titre": "",
        "select_value": "",
        "preg_match": "",
        "preg_match_error": ""
      }
    ],
    "etape": []
  }
}
