<?xml version="1.0" encoding="utf-8"?>
<!-- Generator: Adobe Illustrator 24.1.1, SVG Export Plug-In . SVG Version: 6.00 Build 0)  -->
<svg version="1.1" id="Calque_1" xmlns="http://www.w3.org/2000/svg" xmlns:xlink="http://www.w3.org/1999/xlink" x="0px" y="0px"
	 viewBox="0 0 372 209" style="enable-background:new 0 0 372 209;" xml:space="preserve">
<style type="text/css">
	.st0{fill:#333772;}
</style>
<g id="g10" transform="matrix(1.25,0,0,-1.25,0,335)">
	<g id="g6222" transform="matrix(4.8835797,0,0,4.8835797,-249.14056,-5312.4086)">
		<path id="path2020" class="st0" d="M57.3,1132.5c0,1.1-1,1.9-1.9,1.9h-0.7v-3.6h0.8C56.3,1130.8,57.3,1131.5,57.3,1132.5
			 M60.7,1126.5c-1.5,0-2.4,1-2.6,1.2c-0.2,0.3-1.6,2.4-1.8,2.6c-0.2,0-0.3,0-0.5,0h-0.4h-0.8c0,0,0-2.8,0-3c0-0.3,0.3-0.6,0.6-0.6
			v-0.1h-2.1v0.1c0.3,0,0.6,0.2,0.6,0.6v6.9c0,0.1-0.1,0.6-0.6,0.6v0.1h2.4h0.3c1.3,0,2.3-1,2.3-2.3c0-0.8-0.4-1.4-1-1.9
			c0.3-0.5,1.9-3,2.1-3.2C59.5,1127.4,59.9,1126.7,60.7,1126.5"/>
		<g id="path2024">
			<path class="st0" d="M64.2,1130.8v-3.4c0-0.3,0.3-0.6,0.6-0.6v-0.1h-2.1v0.1c0.3,0,0.6,0.3,0.6,0.6v6.9c0,0.3-0.3,0.6-0.6,0.6
				v0.1h2.1v-0.1c-0.3,0-0.6-0.3-0.6-0.6v-2.9h5.3v2.9c0,0.3-0.3,0.6-0.6,0.6v0.1H71v-0.1c-0.3,0-0.6-0.3-0.6-0.6v-6.9
				c0-0.3,0.3-0.6,0.6-0.6v-0.1H69v0.1c0.3,0,0.6,0.3,0.6,0.6v3.5L64.2,1130.8z"/>
		</g>
		<path id="path2028" class="st0" d="M100.2,1126.5l-6.6,6.8v-5.9c0-0.3,0.3-0.6,0.6-0.6v-0.1h-1.7v0.1c0.3,0,0.6,0.3,0.6,0.6
			c0,0,0,7.9,0,7.9l6.6-6.9v5.9c0,0.3-0.3,0.6-0.6,0.6v0.1h1.7v-0.1c-0.3,0-0.6-0.3-0.6-0.6V1126.5"/>
		<path id="path2032" class="st0" d="M109.1,1134.4h-2.8v-3.1h2.8c0.4,0,0.5,0.3,0.5,0.6h0.1v-1.7h-0.1c0,0.3-0.2,0.6-0.5,0.6h-2.8
			c0,0,0-3.2,0-3.6h2.7c0.8,0,0.9,0.5,1,0.6c0,0,0,0,0.1,0c0-0.1-0.4-0.8-0.6-1.1h-4.7v0.1c0.3,0,0.6,0.3,0.6,0.6c0,0.9,0,6.9,0,6.9
			c0,0.3-0.3,0.6-0.6,0.6v0.1h5v-1.1h-0.1C109.7,1134.1,109.4,1134.4,109.1,1134.4"/>
		<path id="path2036" class="st0" d="M80.6,1136.9c2.5,0,3.9-1.8,3.9-1.9c-1,0.4-1.5,0.6-2.5,0.6c-2.8,0-5.3-2.2-5.3-5.3
			c0-1.3,0.6-2.5,0.7-2.6c-0.4,0-1.9,1.6-1.9,3.9C75.4,1134,77.1,1136.9,80.6,1136.9"/>
		<path id="path2040" class="st0" d="M85.6,1136.2c0.4-0.3,3-2.3,2.9-5.8c0-4-3.4-6.9-6.8-6.9c-3.4,0-5.6,2.8-5.8,3.1
			c0.7-0.5,2-1.7,4.7-1.7c2.9,0,6.6,2.2,6.6,6.8C87.2,1133.3,86.5,1135.2,85.6,1136.2"/>
		<g id="path2044">
			<polygon class="st0" points="85,1139.1 84.9,1138.9 81.6,1140.2 78.4,1138.9 78.3,1139.1 81.6,1141.6 85,1139.1 			"/>
		</g>
	</g>
	<g id="path2048">
		<path class="st0" d="M185.6,109.8h9.2v2.3h-6.7v5.7h6.5v2.3h-6.5v4.1h6.7v2.3h-9.2V109.8z M165.6,124.2h3.9v-14.4h2.5v14.4h3.9
			v2.3h-10.2L165.6,124.2L165.6,124.2z M150,118.9h-0.4v5.4h0.3c2.9,0,4.2-0.8,4.2-2.7C154.1,119.7,152.8,118.9,150,118.9
			 M156.5,121.7c0,1.7-0.9,3.3-2.3,4.1c-1.4,0.8-3.1,0.8-4.4,0.8h-2.7v-16.8h2.5v6.9h0.5c0.1-0.2,4.8-6.9,4.8-6.9h3.1
			c0,0-4.9,6.7-5.2,7.2C155,117.5,156.5,119.3,156.5,121.7 M213.5,114.8c-0.4,0.9-5.7,13-5.7,13l-3.5-18h2.6c0,0,1.6,9,1.8,10.2
			c0.5-1.2,4.8-10.9,4.8-10.9s4.3,9.8,4.8,10.9c0.2-1.3,1.8-10.2,1.8-10.2h2.6l-3.5,18C219.2,127.8,213.9,115.8,213.5,114.8
			 M127,116.3c0.2,0.6,2.2,4.9,2.5,5.7c0.4-0.8,2.3-5.2,2.5-5.7H127z M121.4,109.8h2.7c0,0,1.7,3.8,1.9,4.1h7.2
			c0.1-0.3,1.9-4.1,1.9-4.1h2.7l-8.2,17.8L121.4,109.8L121.4,109.8z M264.6,114.9c-0.8,0.8-12.2,12.8-12.2,12.8v-17.9h2.5v11.8
			c0.8-0.8,12.2-12.8,12.2-12.8v17.8h-2.5L264.6,114.9L264.6,114.9z M232.7,109.8h9.2v2.3h-6.7v5.7h6.5v2.3h-6.5v4.1h6.7v2.3h-9.2
			L232.7,109.8L232.7,109.8z M276.7,126.6v-2.3h3.9v-14.4h2.5v14.4h3.9v2.3H276.7z M85.6,109.8h9.2v2.3h-6.7v5.7h6.5v2.3h-6.5v4.1
			h6.7v2.3h-9.2L85.6,109.8L85.6,109.8z M65.4,112.2h-0.5v12.1h0.5c3.4,0,7.5-1.1,7.5-6C72.9,113.2,68.8,112.2,65.4,112.2 M66,126.6
			h-3.6v-16.8H66c5.8,0,9.4,3.2,9.4,8.5C75.4,123.3,71.7,126.6,66,126.6 M13.2,126.6h-2.5v-16.8h7.5v2.3h-4.9V126.6z M108.5,118.9
			h-0.4v5.3h0.3c2.1,0,4.2-0.3,4.2-2.6C112.6,119.8,111.3,118.9,108.5,118.9 M108.2,126.6h-2.6v-16.8h2.5v6.8h0.9
			c3.8,0,5.9,1.8,5.9,5C115,125.1,112.9,126.6,108.2,126.6 M27.7,109.8h9.2v2.3h-6.7v5.7h6.5v2.3h-6.5v4.1h6.7v2.3h-9.2V109.8z
			 M92.9,131.2l-2.3,1.2l-3-4l1.3-0.8L92.9,131.2z"/>
	</g>
</g>
</svg>
