"num_ind";"date_deb_periode";"date_fin_periode";"montant";"date_calcul";"affichable"
1268;;;0.00;2022-07-21;1
1269;;;0.00;2022-07-21;1
1270;;;0.00;2022-07-21;1
1271;;;0.00;2022-07-21;1
1272;2020-08-01;2020-09-30;473.67;2020-08-09;1
1273;;;0.00;2022-07-21;1
1274;2020-07-01;2022-02-28;1593.68;2022-07-22;1
1268;;;0.00;2022-07-21;1
1269;;;0.00;2022-07-21;1
1270;2013-04-10;2018-06-16;66987.46;2022-07-21;1
1271;2014-06-04;2015-11-20;25505.94;2022-07-21;0
1272;;;0.00;2022-07-21;1
1273;;;0.00;2022-07-21;1
1274;2016-07-09;2017-12-31;0.00;2022-07-21;0
