{
  "@context": {
    "": "https://www.datatourisme.gouv.fr/ontology/core#",
    "data": "https://data.datatourisme.gouv.fr/",
    "schema": "http://schema.org/",
    "owl": "http://www.w3.org/2002/07/owl#",
    "xsd": "http://www.w3.org/2001/XMLSchema#",
    "rdfs": "http://www.w3.org/2000/01/rdf-schema#",
    "olo": "http://purl.org/ontology/olo/core#",
    "dct": "http://purl.org/dc/terms/",
    "rdf": "http://www.w3.org/1999/02/22-rdf-syntax-ns#",
    "xml": "http://www.w3.org/XML/1998/namespace",
    "spin": "http://spinrdf.org/spin#",
    "ebucore": "http://www.ebu.ch/metadata/ontologies/ebucore/ebucore#",
    "sp": "http://spinrdf.org/sp#",
    "foaf": "http://xmlns.com/foaf/0.1/",
    "dc": "http://purl.org/dc/elements/1.1/"
  },
  "@type": "urn:resource"
}