﻿dateDebutInscription,dateFinInscription,statut,regime,codeCommune,uaiEtablissement,nomEtablissement,Étudiants
1/9/2019,31/8/2020,admis,formation initiale,44000,0011402U,EGC AIN BOURG EN BRESSE EC GESTION ET COMMERCE (01000),0906018155T
9/9/2001,9/9/2002,admis,Formation continue,75109,0911101C,Université Paris-Sud 11,0906018128T
9/9/1997,9/9/1998,admis,Formation initiale,75006,0751722P,Université Pierre et Marie Curie - UPCM (Paris 6),0906018118T
9/9/1966,9/9/1967,admis,Formation initiale,75016,0750736T,Université Paris-Dauphine,0906018119T
9/9/2010,9/9/2011,admis,Formation initiale,75016,0750736T,Université Paris-Dauphine,0906018125T
9/9/2011,9/9/2012,admis,Formation initiale,75016,0750736T,Université Paris-Dauphine,0906018126T
9/9/1965,9/9/1966,admis,Formation initiale,75005,0751722P,Université Pierre et Marie Curie - UPCM (Paris 6),0906018120T
9/9/2001,9/9/2002,admis,formation continue,75109,0911101C,Université Paris-Sud 11,0906018128T
9/9/1965,9/9/1966,inscrit,formation initiale,75005,0751722P,Université Pierre et Marie Curie - UPCM (Paris 6),0906018120T
9/9/1966,9/9/1967,admis,formation initiale,75016,0750736T,Université Paris-Dauphine,0906018119T
9/9/1997,9/9/1998,admis,formation initiale,75006,0751722P,Université Pierre et Marie Curie - UPCM (Paris 6),0906018118T
9/9/2010,9/9/2011,admis,formation initiale,75016,0750736T,Université Paris-Dauphine,0906018125T
9/9/2011,9/9/2012,admis,formation initiale,75016,0750736T,Université Paris-Dauphine,0906018126T