﻿identifiant,civilite,nom,nomUsage,prenom,sexe,dateNaissance,codeCertificationCNAV,telephone,telephone2,email,ligneNom,ligneComplementDestinataire,ligneComplementAdresse,ligneVoie,ligneComplementDistribution,codePostal,localite,INSEECommune,dateInscription,dateCessationInscription,categorieInscription
georges_moustaki_77,M.,Moustaki,Moustaki,Georges,M,3/5/1934,VC,0629212921,,georges@moustaki.fr,MOUSTAKI,,,3 rue des Huttes,,75018,75018 Paris,75118,3/5/1965,3/5/1966,PERSONNE SANS EMPLOI DISPONIBLE DUREE INDETERMINEE PLEIN TPS
adurand_28,MME,DURAND,FOURNIER,Audrey,F,15/2/1978,VC,,,adurand@yopmail.com,FOURNIER,,,20 avenue de Ségur,,75109,75009 PARIS,75109,17/8/2002,10/9/2002,PERSONNE SANS EMPLOI DISPONIBLE DUREE INDETERMINEE PLEIN TPS
adubois_18,MME,DUBOIS,DUBOIS,Angela,F,24/8/1962,VC,,,wossewodda-3728@yopmail.com,DUBOIS,,,20 avenue de Ségur,,75009,75009 PARIS,75109,1/2/2008,20/4/2008,PERSONNE SANS EMPLOI DISPONIBLE DUREE INDETERMINEE PLEIN TPS
jdubignot_19,M.,DUBIGNOT,,Jean-Philippe,M,15/6/1943,VC,,,ecuhebup-9337@yopmail.com,DUBIGNOT,,,20 avenue de Ségur,,75009,75009 PARIS,75109,,,PERSONNE SANS EMPLOI DISPONIBLE DUREE INDETERMINEE PLEIN TPS
jdubinore_26,MME,DUBINORE,,Joëlle,F,15/8/1992,VC,,,effannopiq-4009@yopmail.com,DUBINORE,,APPT 9 ETG 9,109 rue La Boétie,,75007,75007 PARIS,75107,17/7/2016,5/1/2017,PERSONNE SANS EMPLOI DISPONIBLE DUREE INDETERMINEE PLEIN TPS
eanicolas_27,M.,DELALALALANDE,,Emmanuel,M,1/7/1991,VC,,,holisadduppe-5969@yopmail.com,DELALALALANDE,,,20 avenue de Ségur,,75009,75009 Paris ,75109,4/6/2020,,PERSONNE SANS EMPLOI DISPONIBLE DUREE INDETERMINEE PLEIN TPS
adubois_59,MME,DUBOIS,,Angela,F,24/8/1962,VC,,,wossewodda-3728@yopmail.com,DUBOIS,,,20 avenue de Ségur,,75009,75009 PARIS,75109,1/2/2008,,PERSONNE SANS EMPLOI DISPONIBLE DUREE DETERMINEE OU SAISON
adurand_29,MME,DURAND,FOURNIER,Audrey,F,15/2/1978,VC,,,adurand@yopmail.com,FOURNIER,,,20 avenue de Ségur,,75109,75009 PARIS,75109,17/8/2002,26/10/2021,PERSONNE SANS EMPLOI DISPONIBLE DUREE DETERMINEE OU SAISON