{
          "request": {
            "hosts": [
              ""
            ],
            "key": {
                "algo":  "rsa",
                "size": 12048
            },
            "names": [
              {
                "C": "FR",
                "ST": "Herault",
                "L": "Montpellier",
                "O": "Mairie de Montpellier",
                "OU": "465146154365143651"
              }
            ],
            "CN": "user@example.org"
          }
        }