{
    "app_admin": {
        "path": "\/admin",
        "pathRegex": "{^\/admin$}sDu",
        "host": "ANY",
        "hostRegex": "",
        "scheme": "ANY",
        "method": "GET",
        "class": "Symfony\\Component\\Routing\\Route",
        "defaults": {
            "_controller": "App\\Controller\\Administrator\\AdministratorController::indexAdministrator"
        },
        "requirements": "NO CUSTOM",
        "options": {
            "compiler_class": "Symfony\\Component\\Routing\\RouteCompiler",
            "utf8": true
        }
    },
    "app_admin_config_phpinfo": {
        "path": "\/admin\/configuration\/phpinfo",
        "pathRegex": "{^\/admin\/configuration\/phpinfo$}sDu",
        "host": "ANY",
        "hostRegex": "",
        "scheme": "ANY",
        "method": "GET",
        "class": "Symfony\\Component\\Routing\\Route",
        "defaults": {
            "_controller": "App\\Controller\\Administrator\\AdministratorController::displayPhpInfo"
        },
        "requirements": "NO CUSTOM",
        "options": {
            "compiler_class": "Symfony\\Component\\Routing\\RouteCompiler",
            "utf8": true
        }
    },
    "app_admin_config": {
        "path": "\/admin\/configuration",
        "pathRegex": "{^\/admin\/configuration$}sDu",
        "host": "ANY",
        "hostRegex": "",
        "scheme": "ANY",
        "method": "GET",
        "class": "Symfony\\Component\\Routing\\Route",
        "defaults": {
            "_controller": "App\\Controller\\Administrator\\AdministratorController::configuration"
        },
        "requirements": "NO CUSTOM",
        "options": {
            "compiler_class": "Symfony\\Component\\Routing\\RouteCompiler",
            "utf8": true
        }
    },
    "app_admin_certificates": {
        "path": "\/admin\/certificates",
        "pathRegex": "{^\/admin\/certificates$}sDu",
        "host": "ANY",
        "hostRegex": "",
        "scheme": "ANY",
        "method": "GET",
        "class": "Symfony\\Component\\Routing\\Route",
        "defaults": {
            "_controller": "App\\Controller\\Administrator\\AdministratorController::certificates"
        },
        "requirements": "NO CUSTOM",
        "options": {
            "compiler_class": "Symfony\\Component\\Routing\\RouteCompiler",
            "utf8": true
        }
    },
    "app_admin_certificates_display": {
        "path": "\/admin\/certificates\/{serialNumber}",
        "pathRegex": "{^\/admin\/certificates\/(?P<serialNumber>[^\/]++)$}sDu",
        "host": "ANY",
        "hostRegex": "",
        "scheme": "ANY",
        "method": "GET",
        "class": "Symfony\\Component\\Routing\\Route",
        "defaults": {
            "_controller": "App\\Controller\\Administrator\\AdministratorController::certificateDisplay"
        },
        "requirements": "NO CUSTOM",
        "options": {
            "compiler_class": "Symfony\\Component\\Routing\\RouteCompiler",
            "utf8": true
        }
    },
    "app_admin_certificates_download": {
        "path": "\/admin\/certificates\/{serialNumber}\/download",
        "pathRegex": "{^\/admin\/certificates\/(?P<serialNumber>[^\/]++)\/download$}sDu",
        "host": "ANY",
        "hostRegex": "",
        "scheme": "ANY",
        "method": "GET",
        "class": "Symfony\\Component\\Routing\\Route",
        "defaults": {
            "_controller": "App\\Controller\\Administrator\\AdministratorController::certificateDownload"
        },
        "requirements": "NO CUSTOM",
        "options": {
            "compiler_class": "Symfony\\Component\\Routing\\RouteCompiler",
            "utf8": true
        }
    },
    "app_admin_config_send_testing_email": {
        "path": "\/admin\/configuration\/test-mail",
        "pathRegex": "{^\/admin\/configuration\/test\\-mail$}sDu",
        "host": "ANY",
        "hostRegex": "",
        "scheme": "ANY",
        "method": "GET",
        "class": "Symfony\\Component\\Routing\\Route",
        "defaults": {
            "_controller": "App\\Controller\\Administrator\\Configuration\\AdministratorTestingEmailConfigController::sendTestingEmail"
        },
        "requirements": "NO CUSTOM",
        "options": {
            "compiler_class": "Symfony\\Component\\Routing\\RouteCompiler",
            "utf8": true
        }
    },
    "app_admin_users_list": {
        "path": "\/admin\/users",
        "pathRegex": "{^\/admin\/users$}sDu",
        "host": "ANY",
        "hostRegex": "",
        "scheme": "ANY",
        "method": "GET|POST",
        "class": "Symfony\\Component\\Routing\\Route",
        "defaults": {
            "_controller": "App\\Controller\\Administrator\\ManageUsersController::index"
        },
        "requirements": "NO CUSTOM",
        "options": {
            "compiler_class": "Symfony\\Component\\Routing\\RouteCompiler",
            "utf8": true
        }
    },
    "app_admin_users_add_manager": {
        "path": "\/admin\/users\/add-manager",
        "pathRegex": "{^\/admin\/users\/add\\-manager$}sDu",
        "host": "ANY",
        "hostRegex": "",
        "scheme": "ANY",
        "method": "GET|POST",
        "class": "Symfony\\Component\\Routing\\Route",
        "defaults": {
            "_controller": "App\\Controller\\Administrator\\ManageUsersController::addManager"
        },
        "requirements": "NO CUSTOM",
        "options": {
            "compiler_class": "Symfony\\Component\\Routing\\RouteCompiler",
            "utf8": true
        }
    },
    "app_admin_users_add_admin": {
        "path": "\/admin\/users\/add-administrator",
        "pathRegex": "{^\/admin\/users\/add\\-administrator$}sDu",
        "host": "ANY",
        "hostRegex": "",
        "scheme": "ANY",
        "method": "GET|POST",
        "class": "Symfony\\Component\\Routing\\Route",
        "defaults": {
            "_controller": "App\\Controller\\Administrator\\ManageUsersController::addAdministrator"
        },
        "requirements": "NO CUSTOM",
        "options": {
            "compiler_class": "Symfony\\Component\\Routing\\RouteCompiler",
            "utf8": true
        }
    },
    "app_admin_users_edit": {
        "path": "\/admin\/users\/{id}\/edit",
        "pathRegex": "{^\/admin\/users\/(?P<id>[^\/]++)\/edit$}sDu",
        "host": "ANY",
        "hostRegex": "",
        "scheme": "ANY",
        "method": "GET|POST",
        "class": "Symfony\\Component\\Routing\\Route",
        "defaults": {
            "_controller": "App\\Controller\\Administrator\\ManageUsersController::editManager"
        },
        "requirements": "NO CUSTOM",
        "options": {
            "compiler_class": "Symfony\\Component\\Routing\\RouteCompiler",
            "utf8": true
        }
    },
    "app_admin_users_delete": {
        "path": "\/admin\/users\/{id}\/delete",
        "pathRegex": "{^\/admin\/users\/(?P<id>[^\/]++)\/delete$}sDu",
        "host": "ANY",
        "hostRegex": "",
        "scheme": "ANY",
        "method": "POST",
        "class": "Symfony\\Component\\Routing\\Route",
        "defaults": {
            "_controller": "App\\Controller\\Administrator\\ManageUsersController::delete"
        },
        "requirements": "NO CUSTOM",
        "options": {
            "compiler_class": "Symfony\\Component\\Routing\\RouteCompiler",
            "utf8": true
        }
    },
    "app_admin_users_display": {
        "path": "\/admin\/users\/{id}",
        "pathRegex": "{^\/admin\/users\/(?P<id>[^\/]++)$}sDu",
        "host": "ANY",
        "hostRegex": "",
        "scheme": "ANY",
        "method": "GET",
        "class": "Symfony\\Component\\Routing\\Route",
        "defaults": {
            "_controller": "App\\Controller\\Administrator\\ManageUsersController::show"
        },
        "requirements": "NO CUSTOM",
        "options": {
            "compiler_class": "Symfony\\Component\\Routing\\RouteCompiler",
            "utf8": true
        }
    },
    "app_public_certificat-authority": {
        "path": "\/certification-authority",
        "pathRegex": "{^\/certification\\-authority$}sDu",
        "host": "ANY",
        "hostRegex": "",
        "scheme": "ANY",
        "method": "GET",
        "class": "Symfony\\Component\\Routing\\Route",
        "defaults": {
            "_controller": "App\\Controller\\CertificationAuthorityController::index"
        },
        "requirements": "NO CUSTOM",
        "options": {
            "compiler_class": "Symfony\\Component\\Routing\\RouteCompiler",
            "utf8": true
        }
    },
    "app_public_certificat-authority_download": {
        "path": "\/certification-authority\/{serialNumber}\/download",
        "pathRegex": "{^\/certification\\-authority\/(?P<serialNumber>[^\/]++)\/download$}sDu",
        "host": "ANY",
        "hostRegex": "",
        "scheme": "ANY",
        "method": "GET",
        "class": "Symfony\\Component\\Routing\\Route",
        "defaults": {
            "_controller": "App\\Controller\\CertificationAuthorityController::downloadCertificate"
        },
        "requirements": "NO CUSTOM",
        "options": {
            "compiler_class": "Symfony\\Component\\Routing\\RouteCompiler",
            "utf8": true
        }
    },
    "app_health_check": {
        "path": "\/health-check",
        "pathRegex": "{^\/health\\-check$}sDu",
        "host": "ANY",
        "hostRegex": "",
        "scheme": "ANY",
        "method": "GET|HEAD",
        "class": "Symfony\\Component\\Routing\\Route",
        "defaults": {
            "_controller": "App\\Controller\\HealthCheckController::index"
        },
        "requirements": "NO CUSTOM",
        "options": {
            "compiler_class": "Symfony\\Component\\Routing\\RouteCompiler",
            "utf8": true
        }
    },
    "app_home": {
        "path": "\/",
        "pathRegex": "{^\/$}sDu",
        "host": "ANY",
        "hostRegex": "",
        "scheme": "ANY",
        "method": "GET|HEAD",
        "class": "Symfony\\Component\\Routing\\Route",
        "defaults": {
            "_controller": "App\\Controller\\HomeController::index"
        },
        "requirements": "NO CUSTOM",
        "options": {
            "compiler_class": "Symfony\\Component\\Routing\\RouteCompiler",
            "utf8": true
        }
    },
    "app_cert-manager_certificate_download": {
        "path": "\/cert-manager\/certificate\/{serialNumber}\/download",
        "pathRegex": "{^\/cert\\-manager\/certificate\/(?P<serialNumber>[^\/]++)\/download$}sDu",
        "host": "ANY",
        "hostRegex": "",
        "scheme": "ANY",
        "method": "GET",
        "class": "Symfony\\Component\\Routing\\Route",
        "defaults": {
            "_controller": "App\\Controller\\Manager\\CertificateAddController::downloadCertificate"
        },
        "requirements": "NO CUSTOM",
        "options": {
            "compiler_class": "Symfony\\Component\\Routing\\RouteCompiler",
            "utf8": true
        }
    },
    "app_cert-manager_certificate_add": {
        "path": "\/cert-manager\/certificate\/add",
        "pathRegex": "{^\/cert\\-manager\/certificate\/add$}sDu",
        "host": "ANY",
        "hostRegex": "",
        "scheme": "ANY",
        "method": "GET|POST",
        "class": "Symfony\\Component\\Routing\\Route",
        "defaults": {
            "_controller": "App\\Controller\\Manager\\CertificateAddController::addCertificate"
        },
        "requirements": "NO CUSTOM",
        "options": {
            "compiler_class": "Symfony\\Component\\Routing\\RouteCompiler",
            "utf8": true
        }
    },
    "app_cert-manager": {
        "path": "\/cert-manager",
        "pathRegex": "{^\/cert\\-manager$}sDu",
        "host": "ANY",
        "hostRegex": "",
        "scheme": "ANY",
        "method": "GET",
        "class": "Symfony\\Component\\Routing\\Route",
        "defaults": {
            "_controller": "App\\Controller\\Manager\\ManagerController::indexManager"
        },
        "requirements": "NO CUSTOM",
        "options": {
            "compiler_class": "Symfony\\Component\\Routing\\RouteCompiler",
            "utf8": true
        }
    },
    "app_cert-manager_certificates": {
        "path": "\/cert-manager\/certificates",
        "pathRegex": "{^\/cert\\-manager\/certificates$}sDu",
        "host": "ANY",
        "hostRegex": "",
        "scheme": "ANY",
        "method": "GET",
        "class": "Symfony\\Component\\Routing\\Route",
        "defaults": {
            "_controller": "App\\Controller\\Manager\\ManagerController::certificates"
        },
        "requirements": "NO CUSTOM",
        "options": {
            "compiler_class": "Symfony\\Component\\Routing\\RouteCompiler",
            "utf8": true
        }
    },
    "app_legacy_cron_certificateRemindLifetime": {
        "path": "\/poc\/ping-reminder\/{reminderTokenViaHttpRequest}",
        "pathRegex": "{^\/poc\/ping\\-reminder\/(?P<reminderTokenViaHttpRequest>[^\/]++)$}sDu",
        "host": "ANY",
        "hostRegex": "",
        "scheme": "ANY",
        "method": "GET",
        "class": "Symfony\\Component\\Routing\\Route",
        "defaults": {
            "_controller": "App\\Controller\\PocCertificateController::legacyCronCertReminder"
        },
        "requirements": "NO CUSTOM",
        "options": {
            "compiler_class": "Symfony\\Component\\Routing\\RouteCompiler",
            "utf8": true
        }
    },
    "app_account_login": {
        "path": "\/account\/login",
        "pathRegex": "{^\/account\/login$}sDu",
        "host": "ANY",
        "hostRegex": "",
        "scheme": "ANY",
        "method": "GET|POST",
        "class": "Symfony\\Component\\Routing\\Route",
        "defaults": {
            "_controller": "App\\Controller\\User\\LoginController::login"
        },
        "requirements": "NO CUSTOM",
        "options": {
            "compiler_class": "Symfony\\Component\\Routing\\RouteCompiler",
            "utf8": true
        }
    },
    "app_account_logout": {
        "path": "\/account\/logout",
        "pathRegex": "{^\/account\/logout$}sDu",
        "host": "ANY",
        "hostRegex": "",
        "scheme": "ANY",
        "method": "GET",
        "class": "Symfony\\Component\\Routing\\Route",
        "defaults": {
            "_controller": "App\\Controller\\User\\LoginController::logout"
        },
        "requirements": "NO CUSTOM",
        "options": {
            "compiler_class": "Symfony\\Component\\Routing\\RouteCompiler",
            "utf8": true
        }
    },
    "app_account_forgot_password_request": {
        "path": "\/account\/forgot-password",
        "pathRegex": "{^\/account\/forgot\\-password$}sDu",
        "host": "ANY",
        "hostRegex": "",
        "scheme": "ANY",
        "method": "GET|POST",
        "class": "Symfony\\Component\\Routing\\Route",
        "defaults": {
            "_controller": "App\\Controller\\User\\LoginController::forgotPassword"
        },
        "requirements": "NO CUSTOM",
        "options": {
            "compiler_class": "Symfony\\Component\\Routing\\RouteCompiler",
            "utf8": true
        }
    },
    "app_account_forgot_password_new-password": {
        "path": "\/account\/forgot-password\/t\/{tokenKey}",
        "pathRegex": "{^\/account\/forgot\\-password\/t\/(?P<tokenKey>[^\/]++)$}sDu",
        "host": "ANY",
        "hostRegex": "",
        "scheme": "ANY",
        "method": "GET|POST",
        "class": "Symfony\\Component\\Routing\\Route",
        "defaults": {
            "_controller": "App\\Controller\\User\\LoginController::forgotPasswordCheckToken"
        },
        "requirements": "NO CUSTOM",
        "options": {
            "compiler_class": "Symfony\\Component\\Routing\\RouteCompiler",
            "utf8": true
        }
    },
    "app_user_profile": {
        "path": "\/user\/profile",
        "pathRegex": "{^\/user\/profile$}sDu",
        "host": "ANY",
        "hostRegex": "",
        "scheme": "ANY",
        "method": "GET",
        "class": "Symfony\\Component\\Routing\\Route",
        "defaults": {
            "_controller": "App\\Controller\\User\\UserProfilController::userDisplayMyProfile"
        },
        "requirements": "NO CUSTOM",
        "options": {
            "compiler_class": "Symfony\\Component\\Routing\\RouteCompiler",
            "utf8": true
        }
    },
    "app_user_profile_change_password": {
        "path": "\/user\/profile\/password",
        "pathRegex": "{^\/user\/profile\/password$}sDu",
        "host": "ANY",
        "hostRegex": "",
        "scheme": "ANY",
        "method": "GET|POST",
        "class": "Symfony\\Component\\Routing\\Route",
        "defaults": {
            "_controller": "App\\Controller\\User\\UserProfilController::userChangeMyPassowrd"
        },
        "requirements": "NO CUSTOM",
        "options": {
            "compiler_class": "Symfony\\Component\\Routing\\RouteCompiler",
            "utf8": true
        }
    },
    "nelmio_security": {
        "path": "\/csp\/report",
        "pathRegex": "{^\/csp\/report$}sDu",
        "host": "ANY",
        "hostRegex": "",
        "scheme": "ANY",
        "method": "POST",
        "class": "Symfony\\Component\\Routing\\Route",
        "defaults": {
            "_controller": "nelmio_security.csp_reporter_controller::indexAction"
        },
        "requirements": "NO CUSTOM",
        "options": {
            "compiler_class": "Symfony\\Component\\Routing\\RouteCompiler",
            "utf8": true
        }
    }
}
