Code_INSEE,Properties_ID,Code_Region,Departement,Code_Dpt,Code_Commune,Commune,Code_Postal,MDPH,Longitude,Latitude,Effectif
1053,00e3e79d-caa0-44cb-8212-4ccb20db66ef,84,Ain,1,1001,Bourg-en-Bresse,1012.0,Maison départementale des personnes handicapées (MDPH) - Ain,5.2174416,46.2024726,7170
10387,e5be7400-8208-42f3-8ff6-10d5f6d1d3d9,44,Aube,10,10002,Troyes,10026.0,Maison départementale des personnes handicapées (MDPH) - Aube,4.074800968,48.29747009,5774
11069,f4849f8e-0011-43e9-82bb-a4031685132b,76,Aude,11,11001,Carcassonne,11855.0,Maison départementale des personnes handicapées (MDPH) - Aude,5.885646,44.346673,11065
12202,c771b7a3-ab1e-4e80-97e2-1e39f65d99ab,76,Aveyron,12,12001,Rodez,12000.0,Maison départementale des personnes handicapées (MDPH) - Aveyron,2.567889,44.350313,5615
13203,b1b21a67-b85a-4ebb-ad8b-0248b8b9fedb,93,Bouches-du-Rhône,13,13001,Marseille,13304.0,Maison départementale des personnes handicapées (MDPH) - Bouches-du-Rhône,5.365659,43.3151525,35880
14118,11374878-015f-40aa-a78a-14d9ca0ebb56,28,Calvados,14,14001,Caen,14000.0,Maison départementale des personnes handicapées (MDPH) - Calvados,-0.3576579988,49.17779922,11019
15014,239d30bd-cada-4403-a775-8a0b66809b14,84,Cantal,15,15001,Aurillac,15000.0,Maison départementale des personnes handicapées (MDPH) - Cantal,2.444519,44.927176,2984
16015,498356d4-2552-47a2-8b3c-46502d7f925b,75,Charente,16,16001,Angoulême,16000.0,Maison départementale des personnes handicapées (MDPH) - Charente,0.1523754,45.6316035,6801
17300,02f4ce8b-876b-42ed-9d53-a2c9670a5a45,75,Charente-Maritime,17,17001,La Rochelle,17005.0,Maison départementale des personnes handicapées (MDPH) - Charente-Maritime,-1.1645972,46.1669346,13097
18033,c29f24a3-10e8-4175-b5fc-ec3fa286d1b7,24,Cher,18,18001,Bourges,18000.0,Maison départementale des personnes handicapées (MDPH) - Cher,2.419618,47.0746866,7599
19272,0f3eb617-cb7d-4a6a-828a-c000b192a20a,75,Corrèze,19,19001,Tulle,19000.0,Maison départementale des personnes handicapées (MDPH) - Corrèze,1.760128975,45.25400543,4872
2408,c2275762-b68f-4345-9a17-d37133cc2393,32,Aisne,2,2001,Laon,2000.0,Maison départementale des personnes handicapées (MDPH) - Aisne,3.603019,49.571519,11406
21231,2618d730-8847-435b-a7b7-2621108c0c12,27,Côte-d'Or,21,21001,Dijon,21035.0,Maison départementale des personnes handicapées (MDPH) - Côte-d'Or,5.0423598,47.326599,8364
22278,0aa0670e-e398-45d7-a2f9-503b1e508470,53,Côtes-d'Armor,22,22001,Plérin,22194.0,Maison départementale des personnes handicapées (MDPH) - Côtes-d'Armor,-2.764769,48.5285845,10743
23096,93b3f6f0-c2c8-4a70-90ae-116e33ba34f4,75,Creuse,23,23001,Guéret,23011.0,Maison départementale des personnes handicapées (MDPH) - Creuse,1.8717651,46.1703512,3305
24322,436957cb-0c47-4943-bc48-44fa9abc98fc,75,Dordogne,24,24001,Périgueux,24016.0,Maison départementale des personnes handicapées (MDPH) - Dordogne,0.7211149,45.184029,8647
25056,876108d9-d529-487d-b35b-a6b8ebde617c,27,Doubs,25,25001,Besançon,25043.0,Maison départementale des personnes handicapées (MDPH) - Doubs,6.035657,47.245736,10279
26362,e2a68e75-44e2-4214-91dd-20e26842ac24,84,Drôme,26,26001,Valence,26905.0,Maison départementale des personnes handicapées (MDPH) - Drôme,4.9045532,44.9032582,9126
27229,2d22cef5-41e1-46a7-a62b-922ec3c62724,28,Eure,27,27001,Évreux,27032.0,Maison départementale des personnes handicapées (MDPH) - Eure,1.163621,49.010878,13561
28085,7e3e6491-9d9a-4ed6-b665-b144a5d61cbe,24,Eure-et-Loir,28,28001,Chartres,28000.0,Maison départementale des personnes handicapées (MDPH) - Eure-et-Loir,1.4835117,48.4436171,6116
29232,c52c8303-e82e-4d2d-af25-86927b1ebfb8,53,Finistère,29,29001,Quimper,29018.0,Maison départementale des personnes handicapées (MDPH) - Finistère,-4.103699327,47.97847844,18470
2A004,2da87ee1-8d40-401e-a411-cd4a926dab56,94,Corse-du-Sud,2A,2A001,Ajaccio,20700.0,Maison départementale des personnes handicapées (MDPH) - Corse-du-Sud,8.7596811,41.9368871,3496
2B033,e6599685-1c53-4cca-b068-02c5459d4355,94,Haute-Corse,2B,2B002,Bastia,20200.0,Maison départementale des personnes handicapées (MDPH) - Haute-Corse,9.449515,42.703598,4582
3321,caaf6f72-714d-400e-9b38-0d1634ec3685,84,Allier,3,3001,Yzeure,3400.0,Maison départementale des personnes handicapées (MDPH) - Allier,3.346257,46.561742,8203
30189,6d11d29d-e3a9-49b3-9dbc-e91eb2bf8d5f,76,Gard,30,30001,Nîmes,30000.0,Maison départementale des personnes handicapées (MDPH) - Gard,4.367494,43.823127,14544
31555,09c9981d-3093-486b-ae86-b6c2ed73ffad,76,Haute-Garonne,31,31001,Toulouse,31070.0,Maison départementale des personnes handicapées (MDPH) - Haute-Garonne,1.4297806,43.611152,28525
32013,ecc7d109-c9b4-4000-953f-a47113282675,76,Gers,32,32001,Auch,32000.0,Maison départementale des personnes handicapées (MDPH) - Gers,0.592018,43.648013,4419
33063,885a9477-e9a3-4433-9d8b-3e3e7873bd09,75,Gironde,33,33001,Bordeaux,33074.0,Maison départementale des personnes handicapées (MDPH) - Gironde,-0.58375,44.837518,28273
34172,f7892477-4515-49d4-9fc7-05629b524077,76,Hérault,34,34001,Montpellier,34086.0,Maison départementale des personnes handicapées (MDPH) - Hérault,3.834272,43.622278,28124
35238,dc3ed23a-6fa1-4f4a-a208-98d0e8151cfc,53,Ille-et-Vilaine,35,35001,Rennes,35031.0,Maison départementale des personnes handicapées (MDPH) - Ille-et-Vilaine,-1.698249,48.126017,21424
36044,79f620de-25f7-49bd-892c-a30882f37f62,24,Indre,36,36001,Châteauroux,36000.0,Maison départementale des personnes handicapées (MDPH) - Indre,1.691820979,46.8082428,5517
38185,3d447481-dbab-4243-bac6-29961cdd6dda,84,Isère,38,38001,Grenoble,38010.0,Maison départementale de l'autonomie (MDA) - Isère,5.7121867,45.1924484,18993
39300,188a3746-2a19-4e67-b5a4-34681042cdb6,27,Jura,39,39001,Lons-le-Saunier,39002.0,Maison départementale des personnes handicapées (MDPH) - Jura,5.5431032,46.6710712,5158
4070,cbeca91a-6577-428a-9d87-91f73f51ede5,93,Alpes-de-Haute-Provence,4,4001,Digne-les-Bains,4000.0,Maison départementale des personnes handicapées (MDPH) - Alpes-de-Haute-Provence,6.239484,44.0909591,3397
40192,ea24dbce-9b75-4107-b91c-5978f1fb48c9,75,Landes,40,40001,Mont-de-Marsan,40025.0,Maison départementale des personnes handicapées (MDPH) - Landes,-0.4867007,43.8909014,7157
41018,a7adf340-f760-4610-8bdc-c6015e8afe06,24,Loir-et-Cher,41,41001,Blois,41000.0,Maison départementale des personnes handicapées (MDPH) - Loir-et-Cher,1.3376121,47.5926249,6040
42218,08316bde-4064-4b49-bb0f-0fa2cb8f7445,84,Loire,42,42001,Saint-Étienne,42000.0,Maison départementale des personnes handicapées (MDPH) - Loire,4.3816284,45.4399654,14665
43157,d9f4f0f5-936c-445a-9095-bf87250da2d4,84,Haute-Loire,43,43001,Le Puy-en-Velay,43009.0,Maison départementale des personnes handicapées (MDPH) - Haute-Loire,3.8862216,45.0389122,5396
44114,0c955933-2a92-4d9d-b4f9-df369e67f3db,52,Loire-Atlantique,44,44001,Orvault,44701.0,Maison départementale des personnes handicapées (MDPH) - Loire-Atlantique,-1.619431973,47.25119122,22468
45234,8fe078f2-fd42-41da-acf3-dddb04d9ec59,24,Loiret,45,45001,Orléans,45081.0,Maison départementale des personnes handicapées (MDPH) - Loiret,1.897789,47.885593,9140
46042,d79721ca-e3ad-4c65-8674-e215a7efe76f,76,Lot,46,46001,Cahors,46000.0,Maison départementale des personnes handicapées (MDPH) - Lot,1.4375084,44.4438968,3144
47001,3eb3f964-aa94-402a-96bf-f9ef2c41ab96,75,Lot-et-Garonne,47,47001,Agen,47000.0,Maison départementale des personnes handicapées (MDPH) - Lot-et-Garonne,0.615382,44.192169,6174
48095,1b1aa224-8e17-4314-90b9-ba8e74d3eecd,76,Lozère,48,48001,Mende,48000.0,Maison départementale des personnes handicapées (MDPH) - Lozère,3.5041023,44.5174966,2736
49007,a72fc165-897c-4f97-aa35-67b211cc4df4,52,Maine-et-Loire,49,49001,Angers,49100.0,Maison départementale des personnes handicapées (MDPH) - Maine-et-Loire,-0.5627989,47.4897811,11309
5061,2c5acd5d-eeb0-4859-8493-52e98f5f97ff,93,Hautes-Alpes,5,5001,Gap,5000.0,Maison départementale des personnes handicapées (MDPH) - Hautes-Alpes,6.0833196,44.5647596,2875
50502,6d676313-3254-48c1-81fd-ac2a85e8961e,28,Manche,50,50001,Saint-Lô,50050.0,Maison départementale des personnes handicapées (MDPH) - Manche,-1.0886749,49.1059301,10639
51108,1945fd95-ad46-4b0d-bbd1-098f0cafd408,44,Marne,51,51001,Châlons-en-Champagne,51000.0,Maison départementale des personnes handicapées (MDPH) - Marne,4.3490605,48.963104,9453
52121,bc335acd-51ed-41be-bf0b-a4194f33d9d6,44,Haute-Marne,52,51494,Chaumont,52901.0,Maison départementale des personnes handicapées (MDPH) - Haute-Marne,5.1417497,48.1142518,4318
53130,94033803-76a9-4868-98f4-fac442fff120,52,Mayenne,53,53001,Laval,53014.0,Maison départementale des personnes handicapées (MDPH) - Mayenne,-0.7401906,48.0538524,4561
54304,9a29914d-1a2a-436d-b73b-97cbf7ce6f5c,44,Meurthe-et-Moselle,54,54001,Laxou,54521.0,Maison départementale des personnes handicapées (MDPH) - Meurthe-et-Moselle,6.1544449,48.686989,11992
55029,9a24dad3-a718-4e56-8a76-97df61706e7e,44,Meuse,55,55001,Bar-le-Duc,55000.0,Maison départementale des personnes handicapées (MDPH) - Meuse,5.1605745,48.7737192,3566
56260,4f5e446c-cb0e-46b7-9a91-e8698e9bb9f0,53,Morbihan,56,56001,Vannes,56009.0,Maison départementale des personnes handicapées (MDPH) - Morbihan,-2.780043,47.669181,14109
57463,3034b72a-e87d-45a2-b4b0-b12cf69de3b7,44,Moselle,57,57001,Metz,57076.0,Maison départementale des personnes handicapées (MDPH) - Moselle,6.2235575,49.1055914,20829
58194,ebf5ac36-64ad-4c84-8a25-58dfa89de0c6,27,Nièvre,58,58001,Nevers,58000.0,Maison départementale des personnes handicapées (MDPH) - Nièvre,3.162845,46.990896,6234
59009,36e29ccf-ba6b-4f7f-a123-bbe3a6e6a813,32,Nord,59,2285,Villeneuve-d'Ascq,59669.0,Maison départementale des personnes handicapées (MDPH) - Nord,3.1376067,50.6166926,61072
6088,efa80d7c-faf7-4194-8b56-4bae190cbe85,93,Alpes-Maritimes,6,6001,Nice,6200.0,Maison départementale des personnes handicapées (MDPH) - Alpes-Maritimes,7.2089934,43.6723884,22084
60057,c32abeeb-ddec-48ec-bddc-c67faa67d1a4,32,Oise,60,60001,Beauvais,60006.0,Maison départementale des personnes handicapées (MDPH) - Oise,2.070499,49.430198,14901
61001,f643b5db-79f2-48c4-89da-dc32d9d12814,28,Orne,61,61001,Alençon,61005.0,Maison départementale des personnes handicapées (MDPH) - Orne,0.111623,48.435385,5029
62041,77a6bd62-bc94-4d9f-8240-96339e5ec04b,32,Pas-de-Calais,62,62001,Arras,62005.0,Maison départementale des personnes handicapées (MDPH) - Pas-de-Calais,2.7295218,50.3050246,27886
63113,9d02a3b8-5247-4c51-893a-6fd2ef1450c0,84,Puy-de-Dôme,63,63001,Clermont-Ferrand,63100.0,Maison départementale des personnes handicapées (MDPH) - Puy-de-Dôme,3.1076456,45.7864974,10819
64445,95b0591b-cf21-43e1-af3b-7f6c25827279,75,Pyrénées-Atlantiques,64,64001,Pau,64000.0,Maison départementale des personnes handicapées (MDPH) - Pyrénées-Atlantiques,-0.362504,43.310525,15606
65440,b4951968-6939-4485-b352-d617a9cf22e4,76,Hautes-Pyrénées,65,65001,Tarbes,65000.0,Maison départementale des personnes handicapées (MDPH) - Hautes-Pyrénées,0.0668163,43.2436383,6700
66136,a47ad863-2919-4748-ab3a-7b1fcee7736d,76,Pyrénées-Orientales,66,66001,Perpignan,66100.0,Maison départementale des personnes handicapées (MDPH) - Pyrénées-Orientales,2.8870316,42.6652302,11360
67482,5d7a0a55-f91c-4add-9d65-115b149c4b71,44,Bas-Rhin,67,67001,Strasbourg,67100.0,Maison départementale des personnes handicapées (MDPH) - Bas-Rhin,7.73788023,48.55070114,16956
68066,168af7f9-ea9b-4148-905e-dfcd13b3fb09,44,Haut-Rhin,68,68001,Colmar,68006.0,Maison départementale des personnes handicapées (MDPH) - Haut-Rhin,7.3652,48.07099,13075
69383,7975fa8b-cafe-4f05-8d30-5c564648e04f,84,Rhône,69,69001,Lyon,69007.0,Maison départementale-métropolitaine des personnes handicapées (MDMPH) - Rhône-Lyon,4.822785,45.730723,31840
7186,adbcb5d3-a725-4fb7-b308-65e218f7f24d,84,Ardèche,7,7001,Privas,7006.0,Maison départementale des personnes handicapées (MDPH) - Ardèche,4.595158,44.733579,6410
70550,9883e507-ad5c-4cc5-9a20-092f69ca30bd,27,Haute-Saône,70,52210,Vesoul,70006.0,Maison départementale des personnes handicapées (MDPH) - Haute-Saône,6.1501078,47.6216365,5382
71270,f2255563-5a82-44dc-9977-3aacf95d1203,27,Saône-et-Loire,71,71001,Mâcon,71026.0,Maison départementale de l'autonomie (MDA-MDPH) - Saône-et-Loire,4.8290709,46.3146671,11623
72181,d4f2c3a4-523c-4769-83e7-925b691cb194,52,Sarthe,72,72001,Le Mans,72019.0,Sarthe Autonomie (Maison départementale de l'autonomie) - Sarthe,0.203381,47.983559,8769
73065,0123b8fa-3d14-4813-bacb-b62fff4a7204,84,Savoie,73,73001,Chambéry,73000.0,Maison départementale des personnes handicapées (MDPH) - Savoie,5.935662,45.565884,6613
74010,f5ed0583-274a-49df-bc5b-d56ef48e77fe,84,Haute-Savoie,74,74001,Annecy,74003.0,Maison départementale des personnes handicapées (MDPH) - Haute-Savoie,6.1172458,45.9009478,8368
75109,00a066cb-ebf9-4de3-9a14-30dffb30d81a,11,Paris,75,75056,Paris,75009.0,Maison départementale des personnes handicapées (MDPH) - Paris,2.3333292,48.8749802,31574
76540,63deddae-4871-4c12-b0a8-d6478a1ee5bc,28,Seine-Maritime,76,76001,Rouen,76100.0,Maison départementale des personnes handicapées (MDPH) - Seine-Maritime,1.08256,49.43699,30419
77445,7a918fcf-41c7-463f-ad22-21d9a96bb088,11,Seine-et-Marne,77,77001,Savigny-le-Temple,77543.0,Maison départementale des personnes handicapées (MDPH) - Seine-et-Marne,2.587457,48.594538,19814
78646,046d0e8b-e504-475b-af3c-8faec008c5f9,11,Yvelines,78,78003,Buc,78539.0,Maison départementale des personnes handicapées (MDPH) - Yvelines,1.7117891164982,48.987748168384,15255
79191,54929fd4-64c1-4312-9658-9f8b429d8dc8,75,Deux-Sèvres,79,79001,Niort,79000.0,Maison départementale des personnes handicapées (MDPH) - Deux-Sèvres,-0.457751799999983,46.3281002,7241
8105,671264b4-f616-4d14-8b35-ec77975f1818,44,Ardennes,8,8001,Charleville-Mézières,8000.0,Maison départementale des personnes handicapées (MDPH) - Ardennes,4.720349789,49.76100159,5946
80021,61f17854-ac7f-47a1-b604-f2b4d5b45769,32,Somme,80,80001,Amiens,80000.0,Maison départementale des personnes handicapées (MDPH) - Somme,2.28305,49.88245,13947
81004,299724cd-b9ba-45cb-a293-6a3bf6d2825e,76,Tarn,81,81001,Albi,81000.0,Maison départementale des personnes handicapées (MDPH) - Tarn,2.14684701,43.93677902,8261
26362,e2a68e75-44e2-4214-91dd-20e26842ac24,76,Tarn-et-Garonne,82,26001,Valence,26905.0,Maison départementale des personnes handicapées (MDPH) - Drôme,4.9045532,44.9032582,5929
82121,58821efc-4b48-4d10-9d56-136ed303a017,76,Tarn-et-Garonne,82,82001,Montauban,82013.0,Maison départementale des personnes handicapées (MDPH) - Tarn-et-Garonne,1.3579067,44.0135764,5929
83090,ecaccacc-e010-4f6b-a7cb-e28ac3ef7b3a,93,Var,83,83001,Ollioules,83192.0,Maison départementale des personnes handicapées (MDPH) - Var,5.8462235,43.1246935,20615
84007,e92b4c31-9805-4873-b844-53fdb8e93388,93,Vaucluse,84,84001,Avignon,84096.0,Maison départementale des personnes handicapées (MDPH) - Vaucluse,4.812178,43.943148,9888
85191,13677fa3-a163-4d07-998f-f0f8e4660c1c,52,Vendée,85,85001,La Roche-sur-Yon,85000.0,Maison départementale des personnes handicapées (MDPH) - Vendée,-1.4374016,46.6769534,10256
86194,9d97a09c-44d5-455a-8a7e-e449f17c8f31,75,Vienne,86,86001,Poitiers,86000.0,Maison départementale des personnes handicapées (MDPH) - Vienne,0.369265,46.577106,6052
87085,cc1f58bf-f18b-4e22-8b90-e56c3659b62a,75,Haute-Vienne,87,87001,Limoges,87031.0,Maison départementale des personnes handicapées (MDPH) - Haute-Vienne,1.249702,45.830622,8551
88160,44730998-527f-4d7c-9bb5-468ceafabc8c,44,Vosges,88,88001,Épinal,88026.0,Maison départementale des personnes handicapées (MDPH) - Vosges,6.450859,48.168946,6760
91228,eb9f20b0-458b-4fff-8047-e2c12e0665f6,27,Yonne,89,91001,Évry,91000.0,Maison départementale des personnes handicapées (MDPH) - Essonne,2.4370307,48.624298,7664
89024,f41d87ea-d111-47e0-b7d7-e20722a8cee4,27,Yonne,89,89001,Perrigny,89005.0,Maison départementale des personnes handicapées (MDPH) - Yonne,3.538462,47.821364,7664
9122,45f64236-b160-41be-a2bb-5905814aa68c,76,Ariège,9,9001,Foix,9000.0,Maison départementale des personnes handicapées (MDPH) - Ariège,1.600219965,42.96170044,3218
90010,f8bae99e-37e4-4ad7-a398-a02010e68341,27,Territoire de Belfort,90,90001,Belfort,90008.0,Maison départementale des personnes handicapées (MDPH) - Territoire de Belfort,6.860300064,47.6371994,2336
92050,3f9f35ee-4761-47c3-8643-bf7b11fcecb4,11,Hauts-de-Seine,92,92002,Nanterre,92016.0,Maison départementale des personnes handicapées (MDPH) - Hauts-de-Seine,2.197939,48.893585,19612
93008,b7261db7-56e9-47eb-9333-2a18d4ae4219,11,Seine-Saint-Denis,93,93001,Bobigny,93000.0,Maison départementale des personnes handicapées (MDPH) - Seine-Saint-Denis,2.450036,48.907814,29445
94028,98a4d3a3-3d62-452e-a9da-d7263de81bc2,11,Val-de-Marne,94,94001,Créteil,94046.0,Maison départementale des personnes handicapées (MDPH) - Val-de-Marne,2.4497741,48.7968962,18437
97113,5d113c29-4b66-4aad-be37-dc200276d22b,1,Guadeloupe ,971,97101,Le Gosier,97190.0,Maison départementale des personnes handicapées (MDPH) - Guadeloupe,-61.484927,16.207808,10066
97209,c964eefc-ace8-4798-8cc7-816d069e5e32,2,Martinique,972,97201,Fort-de-France,97200.0,Maison départementale des personnes handicapées (MDPH) - Martinique,-61.04439,14.60384,9078
97302,292d7c0e-da6e-4335-bc99-974ec2a5cf74,3,Guyane,973,97301,Cayenne,97305.0,Maison départementale des personnes handicapées (MDPH) - Guyane,-52.3269,4.9227,2988
97411,0e1e9e84-7099-459c-98f1-0ad6ef417318,4,La Réunion,974,97401,Saint-Denis,97464.0,Maison départementale des personnes handicapées (MDPH) - La Réunion,55.4489755,-20.8856893,21589
