Properties_ID,Code_INSEE,Nom,Region,Code_Region,Departement,Code_Dpt,Code_Postal,Commune,Longitude,Latitude,URL,effectif_total
50293c9f-e79b-41d7-aef4-d18fcbf66efd,97120,Centre régional des œuvres universitaires et scolaires (CROUS) - Antilles-Guyane,Guadeloupe,1.0,Guadeloupe,971,97164.0,Pointe-à-Pitre,-61.5327,16.2248,http://www.crous-antillesguyane.fr/,208983
0af743a3-60e5-488b-bfc9-ca0b549579f2,97229,Centre local des œuvres universitaires et scolaires (CLOUS) - Schœlcher,Martinique,2.0,Martinique,972,97275.0,Schœlcher,-61.092993,14.620094,http://www.crous-antillesguyane.fr,1614
6d9c988a-492d-47b4-bd18-c73d5f0aff93,97302,Centre local des œuvres universitaires et scolaires (CLOUS) - Cayenne,Guyane,3.0,Guyane,973,97332.0,Cayenne,-52.3084075,4.9277228,http://www.crous-antillesguyane.fr,29420
ea578856-d44d-4bbf-9997-1d9bcb596768,29019,Centre local des œuvres universitaires et scolaires (CLOUS) - Brest,Bretagne,53.0,Finistère,29,29200.0,Brest,-4.493215,48.397796,http://www.crous-rennes.fr,343014
03da99f8-16f9-45aa-bd3c-1a93ce03284d,29232,Centre régional des œuvres universitaires et scolaires (CROUS) de Bretagne - Quimper,Bretagne,53.0,Finistère,29,29107.0,Quimper,-4.097761,47.982157,http://www.crous-rennes.fr,343014
e0793171-3bb2-4ff2-8b57-9379befbf637,56121,Centre local des œuvres universitaires et scolaires (CLOUS) - Lorient,Bretagne,53.0,Morbihan,56,56100.0,Lorient,-3.388201,47.743208,http://www.crous-rennes.fr,140914
c848e323-86bb-472b-b6ca-8c72ecd7854e,44184,Centre local des œuvres universitaires et scolaires (CLOUS) - Saint-Nazaire,Pays de la Loire,52.0,Loire-Atlantique,44,44600.0,Saint-Nazaire,-2.266684,47.262404,http://www.crous-nantes.fr,662411
f54f2bca-d271-447e-be11-7255026bfd1a,35288,Centre local des œuvres universitaires et scolaires (CLOUS) - Saint-Malo,Bretagne,53.0,Ille-et-Vilaine,35,35404.0,Saint-Malo,-1.974289,48.656743,http://www.crous-rennes.fr,838827
296b4a00-c60b-4098-ae61-aa2ffc733623,35238,Centre régional des œuvres universitaires et scolaires (CROUS) - Rennes,Bretagne,53.0,Ille-et-Vilaine,35,35064.0,Rennes,-1.67725,48.115621,http://www.crous-rennes.fr,838827
a2826f8d-2ef1-4894-948c-4ccd247ec3ae,44109,Centre régional des œuvres universitaires et scolaires (CROUS) - Nantes,Pays de la Loire,52.0,Loire-Atlantique,44,44300.0,Nantes,-1.555825,47.244555,http://www.crous-nantes.fr,662411
07675751-5882-48ae-95c5-b89be235e627,17300,Centre local des œuvres universitaires et scolaires (CLOUS) - La Rochelle,Nouvelle-Aquitaine,75.0,Charente-Maritime,17,17026.0,La Rochelle,-1.152878,46.142068,http://www.crous-poitiers.fr,124165
221d1a0c-32ec-4f24-8bf9-1100e094e941,33063,Centre régional des œuvres universitaires et scolaires (CROUS) - Bordeaux,Nouvelle-Aquitaine,75.0,Gironde,33,33080.0,Bordeaux,-0.564382,44.831637,http://www.crous-bordeaux.fr,1156885
fbda857c-d8e9-403c-b42a-a8e8dd0c3bc0,49007,Centre local des oeuvres universitaires et scolaires (CLOUS) - Angers- Maine-et-Loire,Pays de la Loire,52.0,Maine-et-Loire,49,49100.0,Angers,-0.555595,47.467902,http://www.crous-nantes.fr,359877
dd951929-ecd5-4780-a8ad-c847f9a6534d,14118,Centre régional des œuvres universitaires et scolaires (CROUS) de Normandie - Pôle de Caen,Normandie,28.0,Calvados,14,14070.0,Caen,-0.364622,49.193757,http://www.crous-normandie.fr/,477467
a139266a-be04-44fa-8131-ce2c4e665d48,64445,Centre local des œuvres universitaires et scolaires (CLOUS) - Pau,Nouvelle-Aquitaine,75.0,Pyrénées-Atlantiques,64,64000.0,Pau,-0.364514,43.318515,http://www.crous-bordeaux.fr,199158
0585abc0-abbd-4c68-ab21-167639b988d5,76351,Centre local des œuvres universitaires et scolaires (CLOUS) - Le Havre,Normandie,28.0,Seine-Maritime,76,76600.0,Le Havre,0.125632,49.496259,http://www.crous-normandie.fr,615335
69d57779-a18d-4b42-9002-f34e6587c788,86194,Centre régional des œuvres universitaires et scolaires (CROUS) - Poitiers ,Nouvelle-Aquitaine,75.0,Vienne,86,86022.0,Poitiers,0.346174,46.58802,http://www.crous-poitiers.fr,448835
648f5cc1-4503-4fe4-8b79-345c3165e972,37261,Centre local des œuvres universitaires et scolaires (CLOUS) - Tours,Centre-Val de Loire,24.0,Indre-et-Loire,37,37000.0,Tours,0.675184,47.383547,http://www.crous-orleans-tours.fr,403764
c7341032-426f-41f0-9740-cdfcc097dc42,76540,Centre régional des œuvres universitaires et scolaires (CROUS) de Normandie - Siège de Rouen,Normandie,28.0,Seine-Maritime,76,76100.0,Rouen,1.078414,49.430207,http://www.crous-normandie.fr/,615335
ea0e730c-aa3f-4506-a8ec-767079cc40fe,87085,Centre régional des œuvres universitaires et scolaires (CROUS) - Limoges,Nouvelle-Aquitaine,75.0,Haute-Vienne,87,87036.0,Limoges,1.230592,45.817756,http://www.crous-limoges.fr,270688
8860f509-5e91-4f1a-9f9a-eb8fdd4c6f34,31555,Centre régional des œuvres universitaires et scolaires (CROUS) - Toulouse,Occitanie,76.0,Haute-Garonne,31,31070.0,Toulouse,1.44227,43.607469,http://www.crous-toulouse.fr,1405492
10e9ac7a-1112-4d96-9ef2-687841922a92,62160,Centre local des œuvres universitaires et scolaires (CLOUS) - Boulogne-sur-Mer,Hauts-de-France,32.0,Pas-de-Calais,62,62200.0,Boulogne-sur-Mer,1.604948,50.72686,http://www.crous-lille.fr,195007
8d346a22-c3ff-494a-b803-7d8e0d71aea2,45234,Centre régional des œuvres universitaires et scolaires (CROUS) - Orléans-Tours,Centre-Val de Loire,24.0,Loiret,45,45100.0,Orléans,1.938597,47.842951,http://www.crous-orleans-tours.fr,277942
a6df143d-f863-42a0-8674-e224f4701da8,78646,Centre régional des œuvres universitaires et scolaires (CROUS) - Versailles,Île-de-France,11.0,Yvelines,78,78000.0,Versailles,2.142258,48.808438,https://www.crous-versailles.fr/,270576
2a88ce22-e46c-4be0-b590-30f2258d1541,80021,Centre régional des œuvres universitaires et scolaires (CROUS) - Amiens ,Hauts-de-France,32.0,Somme,80,80005.0,Amiens,2.300544,49.897921,http://www.crous-amiens.fr,441011
f6b7b1d4-964c-4531-9f66-0868e369d31d,75105,Centre régional des œuvres universitaires et scolaires (CROUS) - Paris,Île-de-France,11.0,Paris,75,75005.0,Paris 5e Arrondissement,2.337702,48.840388,http://www.crous-paris.fr,3789901
cbfe759e-e6eb-40ea-9cd5-ff9925ff3b8f,59183,Centre local des œuvres universitaires et scolaires (CLOUS) - Dunkerque,Hauts-de-France,32.0,Nord,59,59140.0,Dunkerque,2.3697449,51.0364412,http://www.crous-lille.fr,1555530
b95c703a-b1fc-4a90-b602-1e3aa99f5643,94028,Centre régional des œuvres universitaires et scolaires (CROUS) - Créteil,Île-de-France,11.0,Val-de-Marne,94,94000.0,Créteil,2.447912,48.794481,http://www.crous-creteil.fr/,539293
f070fe5d-de36-4b3e-8b2b-67bfc939de1d,62041,Centre local des œuvres universitaires et scolaires (CLOUS) - Arras,Hauts-de-France,32.0,Pas-de-Calais,62,62000.0,Arras,2.792852,50.283699,http://www.crous-lille.fr,195007
9cf527a4-8128-484a-a34e-2098c3767382,66136,Centre local des œuvres universitaires et scolaires (CLOUS) - Perpignan,Occitanie,76.0,Pyrénées-Orientales,66,66100.0,Perpignan,2.901605,42.68256,http://www.messervices.etudiant.gouv.fr,152085
bbb0ed3a-d5a4-453d-9662-d19c5b0901f4,59350,Centre régional des œuvres universitaires et scolaires (CROUS) - Lille ,Hauts-de-France,32.0,Nord,59,59043.0,Lille,3.073054,50.623482,http://www.crous-lille.fr,1555530
5155f690-8b30-48aa-9a10-2e34a4cca25f,63113,Centre régional des œuvres universitaires et scolaires (CROUS) - Clermont-Ferrand,Auvergne-Rhône-Alpes,84.0,Puy-de-Dôme,63,63037.0,Clermont-Ferrand,3.087238,45.764461,http://www.crous-clermont.fr,539984
e1e0ee2a-7eae-462f-9608-a0607861c0c0,59009,Centre local des œuvres universitaires et scolaires (CLOUS) - Villeneuve-d'Ascq,Hauts-de-France,32.0,Nord,59,59650.0,Villeneuve-d'Ascq,3.136221,50.610613,http://www.crous-lille.fr,1555530
09799e6d-8676-41f0-b756-5e511414d6cf,59512,Centre local des œuvres universitaires et scolaires (CLOUS) - Roubaix,Hauts-de-France,32.0,Nord,59,59100.0,Roubaix,3.178818,50.69156,http://www.crous-lille.fr,1555530
023c65b6-9605-4692-9e16-680e767fb966,59606,Centre local des œuvres universitaires et scolaires (CLOUS) - Valenciennes,Hauts-de-France,32.0,Nord,59,59300.0,Valenciennes,3.512785,50.329765,http://www.crous-lille.fr,1555530
155c6f70-a759-4e3d-9f99-1acd0fd11ad7,34172,Centre régional des œuvres universitaires et scolaires (CROUS) - Montpellier,Occitanie,76.0,Hérault,34,34033.0,Montpellier,3.869828,43.622793,http://www.crous-montpellier.fr,1032590
d9032373-4ca8-46b0-9546-700fe7e94ed2,51454,Centre régional des œuvres universitaires et scolaires (CROUS) - Reims,Grand Est,44.0,Marne,51,51000.0,Reims,4.03309,49.2566,http://www.crous-reims.fr,392007
e1d67f13-2945-4ba9-87d4-b95a5a81a39c,10387,Centre local des œuvres universitaires et scolaires (CLOUS) - Troyes,Grand Est,44.0,Aube,10,10000.0,Troyes,4.084249,48.299417,http://www.crous-reims.fr,44922
48150546-030e-44fa-9300-b377a8f28737,51108,Centre local des œuvres universitaires et scolaires (CLOUS) - Châlons-en-Champagne,Grand Est,44.0,Marne,51,51000.0,Châlons-en-Champagne,4.359397,48.956769,http://www.crous-reims.fr,392007
05dc70e5-9abb-4ecc-a985-21426991aaea,42218,Centre local des œuvres universitaires et scolaires (CLOUS) - Saint-Étienne,Auvergne-Rhône-Alpes,84.0,Loire,42,42023.0,Saint-Étienne,4.392959,45.425655,http://www.crous-lyon.fr,297212
932862c8-5aa1-4cf4-9424-dfc61b4d9b26,69387,Centre régional des œuvres universitaires et scolaires (CROUS) - Lyon,Auvergne-Rhône-Alpes,84.0,Rhône,69,69365.0,Lyon 7e Arrondissement,4.848441,45.745791,http://www.crous-lyon.fr,1750868
15db40fa-10c9-44ae-9a42-60e41b8464e0,21231,Centre régional des œuvres universitaires et scolaires (CROUS) de Bourgogne-Franche-Comté - Pôle de Dijon,Bourgogne-Franche-Comté,27.0,Côte-d'Or,21,21012.0,Dijon,5.034803,47.322872,http://www.crous-dijon.fr,478378
64203ecb-b43d-4d5f-89f1-7596036f352c,97304,Centre local des oeuvres universitaires et scolaires (CLOUS) - Guyane,Guyane,3.0,Guyane,973,97387.0,Kourou,5.1660547,-52.6441492,http://www.crous-antillesguyane.fr,29420
6b942fa9-8388-49fc-8fdb-26ba3d10ae4f,13001,Centre régional des œuvres universitaires et scolaires (CROUS) - Aix-Marseille-Avignon,Provence-Alpes-Côte d'Azur,93.0,Bouches-du-Rhône,13,13621.0,Aix-en-Provence,5.44771,43.5224,http://www.crous-aix-marseille.fr,1146590
e6b5753f-34a2-4b5a-aec9-aae69aef86bd,38185,Centre régional des œuvres universitaires et scolaires (CROUS) - Grenoble,Auvergne-Rhône-Alpes,84.0,Isère,38,38019.0,Grenoble,5.717769,45.192153,http://www.crous-grenoble.fr,846206
690a20af-7236-47a5-87ce-ed67b4ce3943,73051,Centre local des œuvres universitaires et scolaires (CLOUS) - Le Bourget-du-Lac,Auvergne-Rhône-Alpes,84.0,Savoie,73,73370.0,Le Bourget-du-Lac,5.867043,45.642208,http://www.crous-grenoble.fr,209045
97e402de-90b1-4729-beb7-e0e0c5f059f9,73137,Centre local des œuvres universitaires et scolaires (CLOUS) - Chambéry,Auvergne-Rhône-Alpes,84.0,Savoie,73,73000.0,Jacob-Bellecombette,5.914251,45.560642,http://www.crous-grenoble.fr,209045
f9414ce8-375f-459c-8510-837d0dbe186c,25056,Centre régional des œuvres universitaires et scolaires (CROUS) de Bourgogne-Franche-Comté - Siège de Besançon,Bourgogne-Franche-Comté,27.0,Doubs,25,25002.0,Besançon,5.987525,47.248666,http://www.crous-besancon.fr,376775
4c04696f-9991-4c65-a7d2-0c92372e15f2,83062,Centre local des œuvres universitaires et scolaires (CLOUS) - Toulon - La Garde,Provence-Alpes-Côte d'Azur,93.0,Var,83,83130.0,La Garde,6.01736,43.136337,http://www.crous-nice.fr,155933
6ac406b9-4b4f-4b0b-90f5-30907219b16b,54395,Centre régional des œuvres universitaires et scolaires (CROUS) - Lorraine,Grand Est,44.0,Meurthe-et-Moselle,54,54042.0,Nancy,6.158445,48.684473,http://www.crous-nancy-metz.fr,892136
253bd6f9-a9d7-4e31-9c39-2a3c91dc2d29,57463,Centre local des œuvres universitaires et scolaires (CLOUS) - Metz,Grand Est,44.0,Moselle,57,57010.0,Metz,6.162772,49.120387,https://www.crous-lorraine.fr/,77990
8c857135-bc4c-4987-b478-efefb12baa95,6088,Centre régional des œuvres universitaires et scolaires (CROUS) - Nice-Toulon,Provence-Alpes-Côte d'Azur,93.0,Alpes-Maritimes,6,6050.0,Nice,7.25402,43.6978,http://www.crous-nice.fr,476150
c7cea4ef-6684-4f29-9a80-b67d52ade061,68224,Centre local des œuvres universitaires et scolaires (CLOUS) - Mulhouse,Grand Est,44.0,Haut-Rhin,68,68350.0,Mulhouse,7.310675,47.728266,http://www.crous-strasbourg.fr,139235
fcddea44-c9dd-4674-b91d-0a52e88a15f6,67482,Centre régional des œuvres universitaires et scolaires (CROUS) - Strasbourg,Grand Est,44.0,Bas-Rhin,67,67004.0,Strasbourg,7.75931,48.584374,http://www.crous-strasbourg.fr,842999
06a106e0-27db-4323-9b4e-335514e8c8c5,2B096,Centre régional des œuvres universitaires et scolaires (CROUS) - Corse,Corse,94.0,Haute-Corse,2B,20250.0,Corte,9.15573,42.305613,http://www.crous-corse.fr,68475
994176a7-a529-423f-b914-89d03ef33894,97411,Centre régional des œuvres universitaires et scolaires (CROUS) - La Réunion,La Réunion,4.0,La Réunion,974,97490.0,Saint-Denis,55.4868,-20.897,http://www.crous-reunion.fr,223418
