Region,Code_Dpt,Iso Dpt,Pays,Code_Pays,Nb_Failed_Occurrences,Nb_Failed,Erreur_carte,Non_conformité_carte
Auvergne-Rhône-Alpes,1,FR-01,FRANCE,FR,47,5,30,3
Auvergne-Rhône-Alpes,15,FR-15,FRANCE,FR,13,5,10,3
Auvergne-Rhône-Alpes,26,FR-26,FRANCE,FR,25,3.5,10,3
Auvergne-Rhône-Alpes,3,FR-03,FRANCE,FR,21,6,10,6
Auvergne-Rhône-Alpes,38,FR-38,FRANCE,FR,21,5.5,10,3
Auvergne-Rhône-Alpes,42,FR-42,FRANCE,FR,42,5,30,3
Auvergne-Rhône-Alpes,43,FR-43,FRANCE,FR,32,7,30,6
Auvergne-Rhône-Alpes,63,FR-63,FRANCE,FR,19.5,5,10,3
Auvergne-Rhône-Alpes,69,FR-69,FRANCE,FR,16.5,4,10,3
Auvergne-Rhône-Alpes,7,FR-07,FRANCE,FR,43,5,30,3
Auvergne-Rhône-Alpes,73,FR-73,FRANCE,FR,52.5,7,30,6
Auvergne-Rhône-Alpes,74,FR-74,FRANCE,FR,22,5,10,3
Bourgogne-Franche-Comté,21,FR-21,FRANCE,FR,33.5,6.5,30,6
Bourgogne-Franche-Comté,25,FR-25,FRANCE,FR,15,6,10,6
Bourgogne-Franche-Comté,39,FR-39,FRANCE,FR,25.5,7.5,10,6
Bourgogne-Franche-Comté,58,FR-58,FRANCE,FR,72.5,4.5,60,3
Bourgogne-Franche-Comté,70,FR-70,FRANCE,FR,7,2,0,0
Bourgogne-Franche-Comté,71,FR-71,FRANCE,FR,29,5,10,3
Bourgogne-Franche-Comté,89,FR-89,FRANCE,FR,34,3,30,0
Bourgogne-Franche-Comté,90,FR-90,FRANCE,FR,20,7,10,6
Bretagne,22,FR-22,FRANCE,FR,25.5,6,10,6
Bretagne,29,FR-29,FRANCE,FR,32,5,30,3
Bretagne,35,FR-35,FRANCE,FR,37.5,5.5,30,3
Bretagne,56,FR-56,FRANCE,FR,19,5,10,3
Centre-Val de Loire,18,FR-18,FRANCE,FR,29,5,10,3
Centre-Val de Loire,28,FR-28,FRANCE,FR,30.5,5,30,3
Centre-Val de Loire,37,FR-37,FRANCE,FR,22.5,4.5,10,3
Centre-Val de Loire,41,FR-41,FRANCE,FR,1,1,0,0
Centre-Val de Loire,45,FR-45,FRANCE,FR,10,4,10,3
Corse,2A,FR-2A,FRANCE,FR,41,5,30,3
Corse,2B,FR-2B,FRANCE,FR,138,6,60,6
Grand Est,10,FR-10,FRANCE,FR,23,5,10,3
Grand Est,51,FR-51,FRANCE,FR,109,4,60,3
Grand Est,52,FR-52,FRANCE,FR,10,4,10,3
Grand Est,54,FR-54,FRANCE,FR,34.5,5,30,3
Grand Est,55,FR-55,FRANCE,FR,11,4,10,3
Grand Est,57,FR-57,FRANCE,FR,23.5,4,10,3
Grand Est,67,FR-67,FRANCE,FR,15.5,4.5,10,3
Grand Est,68,FR-68,FRANCE,FR,33,5,30,3
Grand Est,8,FR-08,FRANCE,FR,51.5,2.5,30,0
Grand Est,88,FR-88,FRANCE,FR,145.5,6,60,6
Guadeloupe,971,FR-971,FRANCE,FR,31,5,30,3
Guyane,973,FR-973,FRANCE,FR,8,4,0,3
Hauts-de-France,2,FR-02,FRANCE,FR,19.5,4,10,3
Hauts-de-France,59,FR-59,FRANCE,FR,32,5,30,3
Hauts-de-France,60,FR-60,FRANCE,FR,34,5,30,3
Hauts-de-France,62,FR-62,FRANCE,FR,20,5,10,3
Hauts-de-France,80,FR-80,FRANCE,FR,11,4,10,3
Martinique,972,FR-972,FRANCE,FR,50,5,30,3
Mayotte,976,FR-976,FRANCE,FR,32,6,30,6
Normandie,14,FR-14,FRANCE,FR,22,6,10,6
Normandie,27,FR-27,FRANCE,FR,34,4,30,3
Normandie,50,FR-50,FRANCE,FR,16.5,4,10,3
Normandie,61,FR-61,FRANCE,FR,28,8,10,6
Normandie,76,FR-76,FRANCE,FR,26,4.5,10,3
Nouvelle-Aquitaine,16,FR-16,FRANCE,FR,103.5,4,60,3
Nouvelle-Aquitaine,17,FR-17,FRANCE,FR,51,5,30,3
Nouvelle-Aquitaine,19,FR-19,FRANCE,FR,35,7,30,6
Nouvelle-Aquitaine,23,FR-23,FRANCE,FR,18,7,10,6
Nouvelle-Aquitaine,24,FR-24,FRANCE,FR,27,6,10,6
Nouvelle-Aquitaine,33,FR-33,FRANCE,FR,20,5,10,3
Nouvelle-Aquitaine,40,FR-40,FRANCE,FR,68,6,60,6
Nouvelle-Aquitaine,47,FR-47,FRANCE,FR,67,4,60,3
Nouvelle-Aquitaine,64,FR-64,FRANCE,FR,26,5,10,3
Nouvelle-Aquitaine,79,FR-79,FRANCE,FR,26.5,5.5,10,3
Nouvelle-Aquitaine,86,FR-86,FRANCE,FR,30,6,30,6
Nouvelle-Aquitaine,87,FR-87,FRANCE,FR,32.5,5.5,30,3
Occitanie,11,FR-11,FRANCE,FR,14.5,5,10,3
Occitanie,12,FR-12,FRANCE,FR,24.5,6,10,6
Occitanie,30,FR-30,FRANCE,FR,85,9,60,6
Occitanie,31,FR-31,FRANCE,FR,29,4,10,3
Occitanie,32,FR-32,FRANCE,FR,56,7,30,6
Occitanie,34,FR-34,FRANCE,FR,42,5,30,3
Occitanie,46,FR-46,FRANCE,FR,235,5,60,3
Occitanie,48,FR-48,FRANCE,FR,20,7,10,6
Occitanie,65,FR-65,FRANCE,FR,27.5,5,10,3
Occitanie,66,FR-66,FRANCE,FR,63.5,7.5,60,6
Occitanie,81,FR-81,FRANCE,FR,25.5,4.5,10,3
Occitanie,82,FR-82,FRANCE,FR,58.5,4.5,30,3
Occitanie,9,FR-09,FRANCE,FR,32.5,7,30,6
Pays de la Loire,44,FR-44,FRANCE,FR,16,4,10,3
Pays de la Loire,49,FR-49,FRANCE,FR,47,6,30,6
Pays de la Loire,53,FR-53,FRANCE,FR,8,4,0,3
Pays de la Loire,72,FR-72,FRANCE,FR,1,1,0,0
Pays de la Loire,85,FR-85,FRANCE,FR,113,6,60,6
Provence-Alpes-Côte d'Azur,13,FR-13,FRANCE,FR,34,4,30,3
Provence-Alpes-Côte d'Azur,4,FR-04,FRANCE,FR,31,4,30,3
Provence-Alpes-Côte d'Azur,5,FR-05,FRANCE,FR,49.5,5.5,30,3
Provence-Alpes-Côte d'Azur,6,FR-06,FRANCE,FR,35,5,30,3
Provence-Alpes-Côte d'Azur,83,FR-83,FRANCE,FR,18,4,10,3
Provence-Alpes-Côte d'Azur,84,FR-84,FRANCE,FR,38.5,6,30,6
Reunion,974,FR-974,FRANCE,FR,51,6.5,30,6
Île-de-France,77,FR-77,FRANCE,FR,20.5,4.5,10,3
Île-de-France,78,FR-78,FRANCE,FR,25.5,5,10,3
Île-de-France,91,FR-91,FRANCE,FR,32,5,30,3
Île-de-France,92,FR-92,FRANCE,FR,24,4,10,3
Île-de-France,93,FR-93,FRANCE,FR,38,5,30,3
Île-de-France,94,FR-94,FRANCE,FR,32,5,30,3
Île-de-France,95,FR-95,FRANCE,FR,25,5,10,3
