[
  {
    "name": "@xml:lang",
    "type": "attribute",
    "value": "FR",
    "xpath": "tif:Capacites/tif:CapacitesGlobales/tif:Capacite/@xml:lang",
    "minOccurs": 1,
    "maxOccurs": 1,
    "parent": 353
  },
  {
    "name": "@libelle",
    "type": "attribute",
    "value": "Chambre double sans petit déjeuner",
    "xpath": "tif:TarifsN1/tif:DetailTarifs/tif:DetailTarif/@libelle",
    "minOccurs": 1,
    "maxOccurs": 1,
    "parent": 323
  },
  {
    "name": "tif:Sigle",
    "type": "element",
    "value": "Syndicat Mixte des Stations de Ski",
    "xpath": "tif:Contacts/tif:DetailContact/tif:Sigle",
    "minOccurs": 0,
    "maxOccurs": 1,
    "parent": 195
  },
  {
    "name": "tif:DetailDisposition",
    "type": "element",
    "xpath": "tif:Capacites/tif:CapacitesUnites/tif:DetailCapaciteUnite/tif:Dispositions/tif:DetailDisposition",
    "minOccurs": 1,
    "maxOccurs": 5,
    "parent": 327
  },
  {
    "name": "tif:Acces",
    "type": "element",
    "xpath": "tif:Geolocalisations/tif:DetailGeolocalisation/tif:Zone/tif:Points/tif:DetailPoint/tif:Acces",
    "minOccurs": 0,
    "maxOccurs": 1,
    "parent": 127
  },
  {
    "name": "@xml:lang",
    "type": "attribute",
    "value": "FR",
    "xpath": "tif:Geolocalisations/tif:DetailGeolocalisation/tif:Zone/tif:Points/tif:DetailPoint/tif:Environnements/tif:DetailEnvironnement/tif:Nom/@xml:lang",
    "minOccurs": 1,
    "maxOccurs": 1,
    "parent": 244
  },
  {
    "name": "@type",
    "type": "attribute",
    "value": "05.01.01",
    "xpath": "tif:InformationsLegales/tif:ModeGestion/@type",
    "minOccurs": 1,
    "maxOccurs": 1,
    "parent": 267
  },
  {
    "name": "@libelle",
    "type": "attribute",
    "value": "km",
    "xpath": "tif:Geolocalisations/tif:DetailGeolocalisation/tif:Zone/tif:Points/tif:DetailPoint/tif:Acces/tif:DetailAcces/tif:Distance/@libelle",
    "minOccurs": 1,
    "maxOccurs": 1,
    "parent": 215
  },
  {
    "name": "@libelle",
    "type": "attribute",
    "value": "Personne",
    "xpath": "tif:Capacites/tif:CapacitesGlobales/tif:Capacite/@libelle",
    "minOccurs": 1,
    "maxOccurs": 1,
    "parent": 353
  },
  {
    "name": "tif:Hauteur",
    "type": "element",
    "value": "450",
    "xpath": "tif:Multimedia/tif:DetailMultimedia/tif:Hauteur",
    "minOccurs": 0,
    "maxOccurs": 1,
    "parent": 309
  },
  {
    "name": "@type",
    "type": "attribute",
    "value": "14.03.03.05",
    "xpath": "tif:Capacites/tif:CapacitesUnites/tif:DetailCapaciteUnite/tif:Dispositions/tif:DetailDisposition/@type",
    "minOccurs": 1,
    "maxOccurs": 1,
    "parent": 3
  },
  {
    "name": "tif:Langue",
    "type": "element",
    "value": "Français",
    "xpath": "tif:Langues/tif:Usage/tif:Langue",
    "minOccurs": 1,
    "maxOccurs": 10,
    "parent": 185
  },
  {
    "name": "@unite",
    "type": "attribute",
    "value": "01.03.01.14",
    "xpath": "tif:Capacites/tif:CapacitesGlobales/tif:Capacite/@unite",
    "minOccurs": 1,
    "maxOccurs": 1,
    "parent": 353
  },
  {
    "name": "@xml:lang",
    "type": "attribute",
    "value": "FR",
    "xpath": "tif:Classements/tif:DetailClassement/@xml:lang",
    "minOccurs": 1,
    "maxOccurs": 1,
    "parent": 208
  },
  {
    "name": "dc:source",
    "type": "element",
    "value": "TFO027345813174",
    "xpath": "tif:DublinCore/dc:source",
    "minOccurs": 0,
    "maxOccurs": 1,
    "parent": 316
  },
  {
    "name": "tif:Contacts",
    "type": "element",
    "value": "null",
    "xpath": "tif:Contacts",
    "minOccurs": 1,
    "maxOccurs": 2
  },
  {
    "name": "@libelle",
    "type": "attribute",
    "value": "Gare SNCF",
    "xpath": "tif:Geolocalisations/tif:DetailGeolocalisation/tif:Zone/tif:Points/tif:DetailPoint/tif:Acces/tif:DetailAcces/@libelle",
    "minOccurs": 1,
    "maxOccurs": 1,
    "parent": 140
  },
  {
    "name": "tif:TarifStandard",
    "type": "element",
    "value": "7",
    "xpath": "tif:TarifsN1/tif:DetailTarifs/tif:DetailTarif/tif:TarifStandard",
    "minOccurs": 0,
    "maxOccurs": 1,
    "parent": 323
  },
  {
    "name": "tif:Classification",
    "type": "element",
    "value": "Patrimoine culturel",
    "xpath": "tif:DublinCore/tif:Classification",
    "minOccurs": 1,
    "maxOccurs": 1,
    "parent": 316
  },
  {
    "name": "tif:DetailDescriptionComplementaire",
    "type": "element",
    "xpath": "tif:DescriptionsComplementaires/tif:DetailDescriptionComplementaire",
    "minOccurs": 0,
    "maxOccurs": 3,
    "parent": 234
  },
  {
    "name": "@libelle",
    "type": "attribute",
    "value": "Tarifaire",
    "xpath": "tif:Tarifs/tif:DetailTarifs/tif:DetailTarif/tif:DetailPeriode/@libelle",
    "minOccurs": 1,
    "maxOccurs": 1,
    "parent": 251
  },
  {
    "name": "tif:DetailCapacitePrestation",
    "type": "element",
    "xpath": "tif:Capacites/tif:CapacitesPrestations/tif:DetailCapacitePrestation",
    "minOccurs": 1,
    "maxOccurs": 5,
    "parent": 302
  },
  {
    "name": "tif:TarifStandard",
    "type": "element",
    "value": "5",
    "xpath": "tif:Tarifs/tif:DetailTarifs/tif:DetailTarif/tif:TarifStandard",
    "minOccurs": 0,
    "maxOccurs": 1,
    "parent": 70
  },
  {
    "name": "tif:Zone",
    "type": "element",
    "xpath": "tif:Contacts/tif:DetailContact/tif:Adresses/tif:DetailAdresse/tif:DetailGeolocalisation/tif:Zone",
    "minOccurs": 1,
    "maxOccurs": 1,
    "parent": 243
  },
  {
    "name": "@xml:lang",
    "type": "attribute",
    "value": "FR",
    "xpath": "tif:Geolocalisations/tif:DetailGeolocalisation/tif:Zone/tif:Points/tif:DetailPoint/tif:Coordonnees/tif:DetailCoordonnees/@xml:lang",
    "minOccurs": 1,
    "maxOccurs": 1,
    "parent": 75
  },
  {
    "name": "tif:ObservationDetailEnvironnement",
    "type": "element",
    "value": "Dans une zone commerciale.",
    "xpath": "tif:Geolocalisations/tif:DetailGeolocalisation/tif:Zone/tif:Points/tif:DetailPoint/tif:Environnements/tif:DetailEnvironnement/tif:ObservationDetailEnvironnement",
    "minOccurs": 0,
    "maxOccurs": 1,
    "parent": 97
  },
  {
    "name": "@type",
    "type": "attribute",
    "value": "10.01.01",
    "xpath": "tif:Clienteles/tif:DetailClienteles/@type",
    "minOccurs": 1,
    "maxOccurs": 1,
    "parent": 285
  },
  {
    "name": "tif:DetailClient",
    "type": "element",
    "xpath": "tif:Clienteles/tif:DetailClienteles/tif:DetailClient",
    "minOccurs": 1,
    "maxOccurs": 6,
    "parent": 285
  },
  {
    "name": "@libelle",
    "type": "attribute",
    "value": "km",
    "xpath": "tif:Geolocalisations/tif:DetailGeolocalisation/tif:Zone/tif:Points/tif:DetailPoint/tif:Environnements/tif:DetailEnvironnement/tif:Distance/@libelle",
    "minOccurs": 1,
    "maxOccurs": 1,
    "parent": 202
  },
  {
    "name": "tif:Cartes",
    "type": "element",
    "xpath": "tif:Geolocalisations/tif:DetailGeolocalisation/tif:Zone/tif:Points/tif:DetailPoint/tif:Cartes",
    "minOccurs": 0,
    "maxOccurs": 1,
    "empty": true,
    "parent": 127
  },
  {
    "name": "tif:DetailTarifs",
    "type": "element",
    "xpath": "tif:TarifsN1/tif:DetailTarifs",
    "minOccurs": 0,
    "maxOccurs": 1,
    "parent": 372
  },
  {
    "name": "tif:DetailJours",
    "type": "element",
    "xpath": "tif:Periodes/tif:DetailPeriode/tif:Dates/tif:DetailDates/tif:Jours/tif:DetailJours",
    "minOccurs": 0,
    "maxOccurs": 1,
    "parent": 106
  },
  {
    "name": "@id",
    "type": "attribute",
    "value": "1",
    "xpath": "tif:OffresPrestations/tif:DetailOffrePrestation/tif:DetailPrestation/@id",
    "minOccurs": 1,
    "maxOccurs": 1,
    "parent": 369
  },
  {
    "name": "@xml:lang",
    "type": "attribute",
    "value": "FR",
    "xpath": "tif:Geolocalisations/tif:DetailGeolocalisation/tif:Zone/tif:Points/tif:DetailPoint/tif:Acces/tif:DetailAcces/tif:Nom/@xml:lang",
    "minOccurs": 1,
    "maxOccurs": 1,
    "parent": 330
  },
  {
    "name": "tif:Copyright",
    "type": "element",
    "value": "OFFICE DE TOURISME DU REQUISTANAIS",
    "xpath": "tif:Multimedia/tif:DetailMultimedia/tif:Copyright",
    "minOccurs": 0,
    "maxOccurs": 1,
    "parent": 309
  },
  {
    "name": "dc:date",
    "type": "element",
    "value": "Tue Jan 20 10:32:04 CET 2009",
    "xpath": "tif:DublinCore/dc:date",
    "minOccurs": 0,
    "maxOccurs": 1,
    "parent": 316
  },
  {
    "name": "@libelle",
    "type": "attribute",
    "value": "Téléphone",
    "xpath": "tif:Contacts/tif:DetailContact/tif:Adresses/tif:DetailAdresse/tif:Personnes/tif:DetailPersonne/tif:MoyensCommunications/tif:DetailMoyenCom/@libelle",
    "minOccurs": 1,
    "maxOccurs": 1,
    "parent": 151
  },
  {
    "name": "@xml:lang",
    "type": "attribute",
    "value": "FR",
    "xpath": "tif:Capacites/tif:CapacitesGlobales/@xml:lang",
    "minOccurs": 1,
    "maxOccurs": 1,
    "parent": 122
  },
  {
    "name": "tif:TarifMode",
    "type": "element",
    "value": "A la journée",
    "xpath": "tif:TarifsN1/tif:DetailTarifs/tif:DetailTarif/tif:TarifMode",
    "minOccurs": 0,
    "maxOccurs": 1,
    "parent": 323
  },
  {
    "name": "@code",
    "type": "attribute",
    "value": "08.02.04.17",
    "xpath": "tif:Contacts/tif:DetailContact/tif:Adresses/tif:DetailAdresse/tif:DetailGeolocalisation/tif:Zone/tif:Nom/@code",
    "minOccurs": 1,
    "maxOccurs": 1,
    "parent": 103
  },
  {
    "name": "tif:DetailCapaciteUnite",
    "type": "element",
    "xpath": "tif:Capacites/tif:CapacitesUnites/tif:DetailCapaciteUnite",
    "minOccurs": 1,
    "maxOccurs": 12,
    "parent": 104
  },
  {
    "name": "tif:ModesPaiement",
    "type": "element",
    "xpath": "tif:Tarifs/tif:ModesPaiement",
    "minOccurs": 0,
    "maxOccurs": 1,
    "parent": 232
  },
  {
    "name": "tif:ObservationDetailPeriode",
    "type": "element",
    "value": "Ouvert uniquement pour des visites guidées. Conditions, réservations, jours et heures disponibles à l\u0027accueil du musée Joseph Vaylet/Scaphandre d\u0027Espalion au 05 65 44 09 18 ou sur www.musees.aveyron.fr",
    "xpath": "tif:Periodes/tif:DetailPeriode/tif:ObservationDetailPeriode",
    "minOccurs": 0,
    "maxOccurs": 2,
    "parent": 164
  },
  {
    "name": "@type",
    "type": "attribute",
    "value": "13.05.01",
    "xpath": "tif:Tarifs/tif:DetailTarifs/tif:DetailTarif/tif:MontantPourcent/@type",
    "minOccurs": 1,
    "maxOccurs": 1,
    "parent": 359
  },
  {
    "name": "@libelle",
    "type": "attribute",
    "value": "Principal",
    "xpath": "tif:Geolocalisations/tif:DetailGeolocalisation/tif:Zone/tif:Points/tif:DetailPoint/@libelle",
    "minOccurs": 1,
    "maxOccurs": 1,
    "parent": 127
  },
  {
    "name": "@xml:lang",
    "type": "attribute",
    "value": "FR",
    "xpath": "tif:Multimedia/tif:DetailMultimedia/@xml:lang",
    "minOccurs": 1,
    "maxOccurs": 1,
    "parent": 309
  },
  {
    "name": "@xml:lang",
    "type": "attribute",
    "value": "FR",
    "xpath": "tif:Geolocalisations/tif:DetailGeolocalisation/tif:Zone/tif:Points/tif:DetailPoint/tif:Environnements/tif:DetailEnvironnement/tif:Distance/@xml:lang",
    "minOccurs": 1,
    "maxOccurs": 1,
    "parent": 202
  },
  {
    "name": "tif:Capacite",
    "type": "element",
    "value": "1",
    "xpath": "tif:Capacites/tif:CapacitesPrestations/tif:DetailCapacitePrestation/tif:Capacite",
    "minOccurs": 1,
    "maxOccurs": 1,
    "parent": 21
  },
  {
    "name": "tif:Points",
    "type": "element",
    "xpath": "tif:Geolocalisations/tif:DetailGeolocalisation/tif:Zone/tif:Points",
    "minOccurs": 1,
    "maxOccurs": 1,
    "parent": 220
  },
  {
    "name": "tif:SIRET",
    "type": "element",
    "value": "43786774000015",
    "xpath": "tif:InformationsLegales/tif:SIRET",
    "minOccurs": 0,
    "maxOccurs": 1,
    "parent": 205
  },
  {
    "name": "@xml:lang",
    "type": "attribute",
    "value": "FR",
    "xpath": "tif:OffresPrestations/tif:DetailOffrePrestation/tif:DetailPrestation/tif:DescriptionPrestation/@xml:lang",
    "minOccurs": 1,
    "maxOccurs": 1,
    "parent": 278
  },
  {
    "name": "@xml:lang",
    "type": "attribute",
    "value": "FR",
    "xpath": "tif:Geolocalisations/tif:DetailGeolocalisation/tif:Zone/tif:Points/tif:DetailPoint/tif:Acces/tif:DetailAcces/tif:Distance/@xml:lang",
    "minOccurs": 1,
    "maxOccurs": 1,
    "parent": 215
  },
  {
    "name": "@xml:lang",
    "type": "attribute",
    "value": "FR",
    "xpath": "tif:Classements/tif:DetailClassement/tif:ObservationDetailClassement/@xml:lang",
    "minOccurs": 1,
    "maxOccurs": 1,
    "parent": 351
  },
  {
    "name": "tif:Adr1",
    "type": "element",
    "value": "Espace Les Cayres",
    "xpath": "tif:Contacts/tif:DetailContact/tif:DetailContact/tif:Adresses/tif:DetailAdresse/tif:Adr1",
    "minOccurs": 1,
    "maxOccurs": 1,
    "parent": 207
  },
  {
    "name": "tif:ControlledVocabulary",
    "type": "element",
    "value": "Histoire",
    "xpath": "tif:DublinCore/tif:ControlledVocabulary",
    "minOccurs": 0,
    "maxOccurs": 19,
    "parent": 316
  },
  {
    "name": "tif:AgeMax",
    "type": "element",
    "value": "0",
    "xpath": "tif:Clienteles/tif:DetailClienteles/tif:DetailClient/tif:AgeMax",
    "minOccurs": 1,
    "maxOccurs": 1,
    "parent": 27
  },
  {
    "name": "@libelle",
    "type": "attribute",
    "value": "En périphérie de village",
    "xpath": "tif:Geolocalisations/tif:DetailGeolocalisation/tif:Zone/tif:Points/tif:DetailPoint/tif:Environnements/tif:DetailEnvironnement/@libelle",
    "minOccurs": 1,
    "maxOccurs": 1,
    "parent": 97
  },
  {
    "name": "tif:CapaciteMoyenne",
    "type": "element",
    "value": "2",
    "xpath": "tif:Capacites/tif:CapacitesUnites/tif:DetailCapaciteUnite/tif:Dispositions/tif:DetailDisposition/tif:CapaciteMoyenne",
    "minOccurs": 0,
    "maxOccurs": 1,
    "parent": 3
  },
  {
    "name": "@code",
    "type": "attribute",
    "value": "02.01.11.07.16",
    "xpath": "tif:DublinCore/tif:ControlledVocabulary/@code",
    "minOccurs": 1,
    "maxOccurs": 1,
    "parent": 54
  },
  {
    "name": "@libelle",
    "type": "attribute",
    "value": "Propriétaire",
    "xpath": "tif:Contacts/tif:DetailContact/tif:DetailContact/@libelle",
    "minOccurs": 1,
    "maxOccurs": 1,
    "parent": 304
  },
  {
    "name": "@unite",
    "type": "attribute",
    "value": "01.03.03.07",
    "xpath": "tif:OffresPrestations/tif:DetailOffrePrestation/tif:DetailPrestation/tif:DureePrest/@unite",
    "minOccurs": 1,
    "maxOccurs": 1,
    "parent": 341
  },
  {
    "name": "@xml:lang",
    "type": "attribute",
    "value": "FR",
    "xpath": "tif:Geolocalisations/tif:DetailGeolocalisation/tif:Zone/tif:Points/tif:DetailPoint/@xml:lang",
    "minOccurs": 1,
    "maxOccurs": 1,
    "parent": 127
  },
  {
    "name": "@xml:lang",
    "type": "attribute",
    "value": "FR",
    "xpath": "tif:DublinCore/dc:description/@xml:lang",
    "minOccurs": 1,
    "maxOccurs": 1,
    "parent": 81
  },
  {
    "name": "tif:Nom",
    "type": "element",
    "value": "Visite guidée Individuel adulte",
    "xpath": "tif:Tarifs/tif:DetailTarifs/tif:DetailTarif/tif:Nom",
    "minOccurs": 0,
    "maxOccurs": 1,
    "parent": 70
  },
  {
    "name": "@classee",
    "type": "attribute",
    "value": "N",
    "xpath": "tif:Capacites/tif:CapacitesGlobales/tif:Superficie/@classee",
    "minOccurs": 1,
    "maxOccurs": 1,
    "parent": 350
  },
  {
    "name": "tif:DetailOffrePrestation",
    "type": "element",
    "xpath": "tif:OffresPrestations/tif:DetailOffrePrestation",
    "minOccurs": 0,
    "maxOccurs": 7,
    "parent": 168
  },
  {
    "name": "@xml:lang",
    "type": "attribute",
    "value": "FR",
    "xpath": "tif:Multimedia/tif:DetailMultimedia/tif:LegendeRessource/@xml:lang",
    "minOccurs": 1,
    "maxOccurs": 1,
    "parent": 170
  },
  {
    "name": "tif:DetailDates",
    "type": "element",
    "xpath": "tif:Periodes/tif:DetailPeriode/tif:Dates/tif:DetailDates",
    "minOccurs": 1,
    "maxOccurs": 1,
    "parent": 141
  },
  {
    "name": "tif:DescriptionCapaciteUnite",
    "type": "element",
    "value": "Chambres Twin",
    "xpath": "tif:Capacites/tif:CapacitesUnites/tif:DetailCapaciteUnite/tif:DescriptionCapaciteUnite",
    "minOccurs": 0,
    "maxOccurs": 1,
    "parent": 40
  },
  {
    "name": "tif:URL",
    "type": "element",
    "value": "http://www.caravelis.com/xml/oi/TFO020259047335/TFO020259047335-17a/medias/jpg/moulin.jpg",
    "xpath": "tif:Multimedia/tif:DetailMultimedia/tif:URL",
    "minOccurs": 1,
    "maxOccurs": 1,
    "parent": 309
  },
  {
    "name": "tif:DetailTarif",
    "type": "element",
    "xpath": "tif:Tarifs/tif:DetailTarifs/tif:DetailTarif",
    "minOccurs": 0,
    "maxOccurs": 31,
    "parent": 78
  },
  {
    "name": "@xml:lang",
    "type": "attribute",
    "value": "FR",
    "xpath": "tif:Capacites/tif:CapacitesPrestations/tif:DetailCapacitePrestation/tif:Capacite/@xml:lang",
    "minOccurs": 1,
    "maxOccurs": 1,
    "parent": 47
  },
  {
    "name": "tif:Civilite",
    "type": "element",
    "value": "Mademoiselle",
    "xpath": "tif:Contacts/tif:DetailContact/tif:Adresses/tif:DetailAdresse/tif:Personnes/tif:DetailPersonne/tif:Civilite",
    "minOccurs": 0,
    "maxOccurs": 1,
    "parent": 259
  },
  {
    "name": "@type",
    "type": "attribute",
    "value": "01.03.01.03",
    "xpath": "tif:Capacites/tif:CapacitesUnites/tif:DetailCapaciteUnite/@type",
    "minOccurs": 1,
    "maxOccurs": 1,
    "parent": 40
  },
  {
    "name": "tif:DescriptionCapacitePrestation",
    "type": "element",
    "value": "Accès handicapés",
    "xpath": "tif:Capacites/tif:CapacitesPrestations/tif:DetailCapacitePrestation/tif:DescriptionCapacitePrestation",
    "minOccurs": 0,
    "maxOccurs": 1,
    "parent": 21
  },
  {
    "name": "tif:DetailCoordonnees",
    "type": "element",
    "xpath": "tif:Geolocalisations/tif:DetailGeolocalisation/tif:Zone/tif:Points/tif:DetailPoint/tif:Coordonnees/tif:DetailCoordonnees",
    "minOccurs": 0,
    "maxOccurs": 1,
    "parent": 92
  },
  {
    "name": "tif:Moment",
    "type": "element",
    "xpath": "tif:Periodes/tif:DetailPeriode/tif:Dates/tif:DetailDates/tif:Moments/tif:DetailMoments/tif:Moment",
    "minOccurs": 0,
    "maxOccurs": 5,
    "empty": true,
    "parent": 308
  },
  {
    "name": "@xml:lang",
    "type": "attribute",
    "value": "FR",
    "xpath": "tif:DublinCore/dc:subject/@xml:lang",
    "minOccurs": 1,
    "maxOccurs": 1,
    "parent": 314
  },
  {
    "name": "tif:DetailTarifs",
    "type": "element",
    "xpath": "tif:Tarifs/tif:DetailTarifs",
    "minOccurs": 0,
    "maxOccurs": 1,
    "parent": 232
  },
  {
    "name": "tif:DetailContact",
    "type": "element",
    "xpath": "tif:ModesReservations/tif:DetailModeReservation/tif:Contacts/tif:DetailContact",
    "minOccurs": 1,
    "maxOccurs": 1,
    "parent": 181
  },
  {
    "name": "@libelle",
    "type": "attribute",
    "value": "Capacité Globale",
    "xpath": "tif:Capacites/tif:CapacitesGlobales/@libelle",
    "minOccurs": 1,
    "maxOccurs": 1,
    "parent": 122
  },
  {
    "name": "dc:description",
    "type": "element",
    "value": "Visite guid\u0026eacute;e du Mus\u0026eacute;e (1h environ). Vid\u0026eacute;o retra\u0026ccedil;ant la vie du po\u0026egrave;te Fran\u0026ccedil;ois Fabi\u0026eacute; et les savoir faire du XIX\u0026egrave;me si\u0026egrave;cle. Moulin \u0026agrave; farine, four \u0026agrave; pain, mise en fonction de la scie battante hydraulique. Promenade litt\u0026eacute;raire autour des moulins en longeant le ruisseau \"La Durenque\". Animations estivales \"du bl\u0026eacute; au pain\". Boutique de produits de terroir. Ouverture : mai, juin et octobre : dimanches et jours f\u0026eacute;ri\u0026eacute;s de 14h30 \u0026agrave; 18h30. Juillet, ao\u0026ucirc;t, septembre : tous les jours de 14h30 \u0026agrave; 18h30. Du 1er avril au 31 octobre : accueil de groupes et ateliers p\u0026eacute;dagogiques sur r\u0026eacute;servation. \u003cbr/\u003e",
    "xpath": "tif:DublinCore/dc:description",
    "minOccurs": 0,
    "maxOccurs": 4,
    "parent": 316
  },
  {
    "name": "@xml:lang",
    "type": "attribute",
    "value": "FR",
    "xpath": "tif:Langues/tif:Usage/tif:Langue/@xml:lang",
    "minOccurs": 1,
    "maxOccurs": 1,
    "parent": 11
  },
  {
    "name": "@xml:lang",
    "type": "attribute",
    "value": "FR",
    "xpath": "tif:DublinCore/dc:title/@xml:lang",
    "minOccurs": 1,
    "maxOccurs": 1,
    "parent": 172
  },
  {
    "name": "@xml:lang",
    "type": "attribute",
    "value": "FR",
    "xpath": "tif:Classements/tif:DetailClassement/tif:Classement/@xml:lang",
    "minOccurs": 1,
    "maxOccurs": 1,
    "parent": 313
  },
  {
    "name": "tif:Pays",
    "type": "element",
    "value": "FRANCE",
    "xpath": "tif:Contacts/tif:DetailContact/tif:DetailContact/tif:Adresses/tif:DetailAdresse/tif:Pays",
    "minOccurs": 1,
    "maxOccurs": 1,
    "parent": 207
  },
  {
    "name": "tif:Nom",
    "type": "element",
    "value": "PELLETIER",
    "xpath": "tif:Contacts/tif:DetailContact/tif:Adresses/tif:DetailAdresse/tif:Personnes/tif:DetailPersonne/tif:Nom",
    "minOccurs": 0,
    "maxOccurs": 1,
    "parent": 259
  },
  {
    "name": "@type",
    "type": "attribute",
    "value": "09.03.02",
    "xpath": "tif:Periodes/tif:DetailPeriode/tif:Dates/tif:DetailDates/tif:Jours/tif:DetailJours/@type",
    "minOccurs": 1,
    "maxOccurs": 1,
    "parent": 31
  },
  {
    "name": "@libelle",
    "type": "attribute",
    "value": "Bungalow",
    "xpath": "tif:Capacites/tif:CapacitesUnites/tif:DetailCapaciteUnite/@libelle",
    "minOccurs": 1,
    "maxOccurs": 1,
    "parent": 40
  },
  {
    "name": "tif:APE_NAF",
    "type": "element",
    "value": "927C",
    "xpath": "tif:InformationsLegales/tif:APE_NAF",
    "minOccurs": 0,
    "maxOccurs": 1,
    "parent": 205
  },
  {
    "name": "tif:NumeroClassement",
    "type": "element",
    "value": "IM012130008",
    "xpath": "tif:Classements/tif:DetailClassement/tif:NumeroClassement",
    "minOccurs": 0,
    "maxOccurs": 1,
    "parent": 208
  },
  {
    "name": "tif:MontantPourcent",
    "type": "element",
    "value": "Montant",
    "xpath": "tif:TarifsN1/tif:DetailTarifs/tif:DetailTarif/tif:MontantPourcent",
    "minOccurs": 1,
    "maxOccurs": 1,
    "parent": 323
  },
  {
    "name": "tif:Coordonnees",
    "type": "element",
    "xpath": "tif:Geolocalisations/tif:DetailGeolocalisation/tif:Zone/tif:Points/tif:DetailPoint/tif:Coordonnees",
    "minOccurs": 1,
    "maxOccurs": 1,
    "parent": 127
  },
  {
    "name": "tif:Prenom",
    "type": "element",
    "value": "Lionel",
    "xpath": "tif:Contacts/tif:DetailContact/tif:DetailContact/tif:Adresses/tif:DetailAdresse/tif:Personnes/tif:DetailPersonne/tif:Prenom",
    "minOccurs": 1,
    "maxOccurs": 1,
    "parent": 324
  },
  {
    "name": "tif:TarifMin",
    "type": "element",
    "value": "9",
    "xpath": "tif:Tarifs/tif:DetailTarifs/tif:DetailTarif/tif:TarifMin",
    "minOccurs": 0,
    "maxOccurs": 1,
    "parent": 70
  },
  {
    "name": "tif:ObservationModeReservation",
    "type": "element",
    "value": "GITES DE FRANCE RESERVATION Aveyron Lot Tarn et Garonne",
    "xpath": "tif:ModesReservations/tif:DetailModeReservation/tif:ObservationModeReservation",
    "minOccurs": 0,
    "maxOccurs": 1,
    "parent": 256
  },
  {
    "name": "@libelle",
    "type": "attribute",
    "value": "Chambre(s)",
    "xpath": "tif:Capacites/tif:CapacitesPrestations/tif:DetailCapacitePrestation/tif:Capacite/@libelle",
    "minOccurs": 1,
    "maxOccurs": 1,
    "parent": 47
  },
  {
    "name": "tif:DetailEnvironnement",
    "type": "element",
    "xpath": "tif:Geolocalisations/tif:DetailGeolocalisation/tif:Zone/tif:Points/tif:DetailPoint/tif:Environnements/tif:DetailEnvironnement",
    "minOccurs": 0,
    "maxOccurs": 9,
    "parent": 239
  },
  {
    "name": "tif:TarifDevise",
    "type": "element",
    "value": "Euro",
    "xpath": "tif:Tarifs/tif:DetailTarifs/tif:DetailTarif/tif:TarifDevise",
    "minOccurs": 0,
    "maxOccurs": 1,
    "parent": 70
  },
  {
    "name": "dc:creator",
    "type": "element",
    "value": "pierre",
    "xpath": "tif:DublinCore/dc:creator",
    "minOccurs": 0,
    "maxOccurs": 1,
    "parent": 316
  },
  {
    "name": "@libelle",
    "type": "attribute",
    "value": "Image",
    "xpath": "tif:Multimedia/tif:DetailMultimedia/@libelle",
    "minOccurs": 1,
    "maxOccurs": 1,
    "parent": 309
  },
  {
    "name": "@type",
    "type": "attribute",
    "value": "04.03.30",
    "xpath": "tif:Contacts/tif:DetailContact/tif:DetailContact/@type",
    "minOccurs": 1,
    "maxOccurs": 1,
    "parent": 304
  },
  {
    "name": "@type",
    "type": "attribute",
    "value": "08.02.03.96",
    "xpath": "tif:Geolocalisations/tif:DetailGeolocalisation/tif:Zone/tif:Points/tif:DetailPoint/tif:Environnements/tif:DetailEnvironnement/@type",
    "minOccurs": 1,
    "maxOccurs": 1,
    "parent": 97
  },
  {
    "name": "tif:Nom",
    "type": "element",
    "value": "Midi-Pyrénées",
    "xpath": "tif:Contacts/tif:DetailContact/tif:Adresses/tif:DetailAdresse/tif:DetailGeolocalisation/tif:Zone/tif:Nom",
    "minOccurs": 1,
    "maxOccurs": 1,
    "parent": 23
  },
  {
    "name": "tif:CapacitesUnites",
    "type": "element",
    "xpath": "tif:Capacites/tif:CapacitesUnites",
    "minOccurs": 0,
    "maxOccurs": 1,
    "parent": 192
  },
  {
    "name": "tif:Nom",
    "type": "element",
    "value": "Double - Douche/wc",
    "xpath": "tif:Capacites/tif:CapacitesUnites/tif:DetailCapaciteUnite/tif:Nom",
    "minOccurs": 0,
    "maxOccurs": 1,
    "parent": 40
  },
  {
    "name": "tif:Jours",
    "type": "element",
    "xpath": "tif:Periodes/tif:DetailPeriode/tif:Dates/tif:DetailDates/tif:Jours",
    "minOccurs": 0,
    "maxOccurs": 1,
    "parent": 67
  },
  {
    "name": "@unite",
    "type": "attribute",
    "value": "01.03.01.06",
    "xpath": "tif:Capacites/tif:CapacitesPrestations/tif:DetailCapacitePrestation/tif:Capacite/@unite",
    "minOccurs": 1,
    "maxOccurs": 1,
    "parent": 47
  },
  {
    "name": "tif:ModesReservations",
    "type": "element",
    "xpath": "tif:ModesReservations",
    "minOccurs": 1,
    "maxOccurs": 1
  },
  {
    "name": "@lib_moment",
    "type": "attribute",
    "value": "09.04.03",
    "xpath": "tif:Periodes/tif:DetailPeriode/tif:Dates/tif:DetailDates/tif:Moments/tif:DetailMoments/tif:Moment/@lib_moment",
    "minOccurs": 1,
    "maxOccurs": 1,
    "parent": 76
  },
  {
    "name": "@libelle",
    "type": "attribute",
    "value": "Accueil",
    "xpath": "tif:Langues/tif:Usage/@libelle",
    "minOccurs": 1,
    "maxOccurs": 1,
    "parent": 185
  },
  {
    "name": "@libelle",
    "type": "attribute",
    "value": "Individuel adulte",
    "xpath": "tif:Tarifs/tif:DetailTarifs/tif:DetailTarif/@libelle",
    "minOccurs": 1,
    "maxOccurs": 1,
    "parent": 70
  },
  {
    "name": "tif:NbUnites",
    "type": "element",
    "value": "0",
    "xpath": "tif:Capacites/tif:CapacitesUnites/tif:DetailCapaciteUnite/tif:NbUnites",
    "minOccurs": 1,
    "maxOccurs": 1,
    "parent": 40
  },
  {
    "name": "@type",
    "type": "attribute",
    "value": "13.01.01",
    "xpath": "tif:Tarifs/tif:DetailTarifs/tif:DetailTarif/tif:TarifDevise/@type",
    "minOccurs": 1,
    "maxOccurs": 1,
    "parent": 98
  },
  {
    "name": "tif:DetailDates",
    "type": "element",
    "xpath": "tif:Tarifs/tif:DetailTarifs/tif:DetailTarif/tif:DetailPeriode/tif:Dates/tif:DetailDates",
    "minOccurs": 1,
    "maxOccurs": 4,
    "parent": 333
  },
  {
    "name": "@code",
    "type": "attribute",
    "value": "12096",
    "xpath": "tif:Geolocalisations/tif:DetailGeolocalisation/tif:Zone/tif:Points/tif:DetailPoint/tif:Environnements/tif:DetailEnvironnement/tif:Commune/@code",
    "minOccurs": 1,
    "maxOccurs": 1,
    "parent": 139
  },
  {
    "name": "@type",
    "type": "attribute",
    "value": "08.01.04",
    "xpath": "tif:Contacts/tif:DetailContact/tif:Adresses/tif:DetailAdresse/tif:DetailGeolocalisation/@type",
    "minOccurs": 1,
    "maxOccurs": 1,
    "parent": 243
  },
  {
    "name": "tif:RaisonSociale",
    "type": "element",
    "value": "HOTEL - LE RELAIS DE LAGUIOLE",
    "xpath": "tif:Contacts/tif:DetailContact/tif:DetailContact/tif:RaisonSociale",
    "minOccurs": 1,
    "maxOccurs": 1,
    "parent": 304
  },
  {
    "name": "@libelle",
    "type": "attribute",
    "value": "ha",
    "xpath": "tif:Capacites/tif:CapacitesGlobales/tif:Superficie/@libelle",
    "minOccurs": 1,
    "maxOccurs": 1,
    "parent": 350
  },
  {
    "name": "@xml:lang",
    "type": "attribute",
    "value": "FR",
    "xpath": "tif:Tarifs/tif:DetailTarifs/tif:DetailTarif/tif:DescriptionTarif/@xml:lang",
    "minOccurs": 1,
    "maxOccurs": 1,
    "parent": 227
  },
  {
    "name": "@type",
    "type": "attribute",
    "value": "04.03.13",
    "xpath": "tif:Contacts/tif:DetailContact/@type",
    "minOccurs": 1,
    "maxOccurs": 1,
    "parent": 195
  },
  {
    "name": "@code",
    "type": "attribute",
    "value": "08.02.04.17",
    "xpath": "tif:Geolocalisations/tif:DetailGeolocalisation/tif:Zone/tif:Nom/@code",
    "minOccurs": 1,
    "maxOccurs": 1,
    "parent": 165
  },
  {
    "name": "tif:CapacitesGlobales",
    "type": "element",
    "xpath": "tif:Capacites/tif:CapacitesGlobales",
    "minOccurs": 0,
    "maxOccurs": 1,
    "parent": 192
  },
  {
    "name": "@xml:lang",
    "type": "attribute",
    "value": "FR",
    "xpath": "tif:Geolocalisations/tif:DetailGeolocalisation/tif:Zone/tif:Points/tif:DetailPoint/tif:Nom/@xml:lang",
    "minOccurs": 1,
    "maxOccurs": 1,
    "parent": 381
  },
  {
    "name": "tif:Adr2",
    "type": "element",
    "value": "BP 724",
    "xpath": "tif:Contacts/tif:DetailContact/tif:Adresses/tif:DetailAdresse/tif:Adr2",
    "minOccurs": 0,
    "maxOccurs": 1,
    "parent": 272
  },
  {
    "name": "tif:Adr3",
    "type": "element",
    "value": "B.P. 724",
    "xpath": "tif:Contacts/tif:DetailContact/tif:Adresses/tif:DetailAdresse/tif:Adr3",
    "minOccurs": 0,
    "maxOccurs": 1,
    "parent": 272
  },
  {
    "name": "tif:Adr1",
    "type": "element",
    "value": "Place Frontin",
    "xpath": "tif:Contacts/tif:DetailContact/tif:Adresses/tif:DetailAdresse/tif:Adr1",
    "minOccurs": 0,
    "maxOccurs": 1,
    "parent": 272
  },
  {
    "name": "tif:DetailPoint",
    "type": "element",
    "xpath": "tif:Geolocalisations/tif:DetailGeolocalisation/tif:Zone/tif:Points/tif:DetailPoint",
    "minOccurs": 1,
    "maxOccurs": 1,
    "parent": 48
  },
  {
    "name": "@libelle",
    "type": "attribute",
    "value": "Etab/Lieu/Structure",
    "xpath": "tif:Contacts/tif:DetailContact/@libelle",
    "minOccurs": 1,
    "maxOccurs": 1,
    "parent": 195
  },
  {
    "name": "tif:TarifMin",
    "type": "element",
    "value": "58",
    "xpath": "tif:TarifsN1/tif:DetailTarifs/tif:DetailTarif/tif:TarifMin",
    "minOccurs": 0,
    "maxOccurs": 1,
    "parent": 323
  },
  {
    "name": "@type",
    "type": "attribute",
    "value": "13.02.08",
    "xpath": "tif:Tarifs/tif:ModesPaiement/tif:ModePaiement/@type",
    "minOccurs": 1,
    "maxOccurs": 1,
    "parent": 169
  },
  {
    "name": "tif:ObservationDetailAcces",
    "type": "element",
    "value": "Quittez l\u0027autoroute A 75 à La Cavalerie. Prendre la RD 277",
    "xpath": "tif:Geolocalisations/tif:DetailGeolocalisation/tif:Zone/tif:Points/tif:DetailPoint/tif:Acces/tif:DetailAcces/tif:ObservationDetailAcces",
    "minOccurs": 0,
    "maxOccurs": 1,
    "parent": 140
  },
  {
    "name": "@type",
    "type": "attribute",
    "value": "10.02.27",
    "xpath": "tif:Clienteles/tif:DetailClienteles/tif:DetailClient/@type",
    "minOccurs": 1,
    "maxOccurs": 1,
    "parent": 27
  },
  {
    "name": "tif:Cedex",
    "type": "element",
    "value": "Cédex 3",
    "xpath": "tif:Contacts/tif:DetailContact/tif:Adresses/tif:DetailAdresse/tif:Cedex",
    "minOccurs": 0,
    "maxOccurs": 1,
    "parent": 272
  },
  {
    "name": "tif:CapaciteMini",
    "type": "element",
    "value": "0",
    "xpath": "tif:Capacites/tif:CapacitesUnites/tif:DetailCapaciteUnite/tif:Dispositions/tif:DetailDisposition/tif:CapaciteMini",
    "minOccurs": 0,
    "maxOccurs": 1,
    "parent": 3
  },
  {
    "name": "@libelle",
    "type": "attribute",
    "value": "Equipements",
    "xpath": "tif:OffresPrestations/tif:DetailOffrePrestation/@libelle",
    "minOccurs": 1,
    "maxOccurs": 1,
    "parent": 65
  },
  {
    "name": "@type",
    "type": "attribute",
    "value": "04.03.30",
    "xpath": "tif:ModesReservations/tif:DetailModeReservation/tif:Contacts/tif:DetailContact/@type",
    "minOccurs": 1,
    "maxOccurs": 1,
    "parent": 79
  },
  {
    "name": "@Nom",
    "type": "attribute",
    "xpath": "tif:Periodes/tif:DetailPeriode/@Nom",
    "minOccurs": 1,
    "maxOccurs": 1,
    "empty": true,
    "parent": 164
  },
  {
    "name": "@unite",
    "type": "attribute",
    "value": "01.03.02.01",
    "xpath": "tif:OffresPrestations/tif:DetailOffrePrestation/tif:DetailPrestation/tif:Distance/@unite",
    "minOccurs": 1,
    "maxOccurs": 1,
    "parent": 158
  },
  {
    "name": "tif:Commune",
    "type": "element",
    "value": "Espalion",
    "xpath": "tif:Geolocalisations/tif:DetailGeolocalisation/tif:Zone/tif:Points/tif:DetailPoint/tif:Environnements/tif:DetailEnvironnement/tif:Commune",
    "minOccurs": 0,
    "maxOccurs": 1,
    "parent": 97
  },
  {
    "name": "tif:DetailAcces",
    "type": "element",
    "xpath": "tif:Geolocalisations/tif:DetailGeolocalisation/tif:Zone/tif:Points/tif:DetailPoint/tif:Acces/tif:DetailAcces",
    "minOccurs": 0,
    "maxOccurs": 11,
    "parent": 4
  },
  {
    "name": "tif:Dates",
    "type": "element",
    "xpath": "tif:Periodes/tif:DetailPeriode/tif:Dates",
    "minOccurs": 1,
    "maxOccurs": 1,
    "parent": 164
  },
  {
    "name": "@libelle",
    "type": "attribute",
    "value": "année",
    "xpath": "tif:OffresPrestations/tif:DetailOffrePrestation/tif:DetailPrestation/tif:DureePrest/@libelle",
    "minOccurs": 1,
    "maxOccurs": 1,
    "parent": 341
  },
  {
    "name": "tif:Prestation",
    "type": "element",
    "value": "Parking",
    "xpath": "tif:OffresPrestations/tif:DetailOffrePrestation/tif:DetailPrestation/tif:Prestation",
    "minOccurs": 0,
    "maxOccurs": 1,
    "parent": 369
  },
  {
    "name": "tif:Inclus",
    "type": "element",
    "value": "O",
    "xpath": "tif:OffresPrestations/tif:DetailOffrePrestation/tif:DetailPrestation/tif:Inclus",
    "minOccurs": 0,
    "maxOccurs": 2,
    "parent": 369
  },
  {
    "name": "tif:Adresses",
    "type": "element",
    "xpath": "tif:Contacts/tif:DetailContact/tif:Adresses",
    "minOccurs": 0,
    "maxOccurs": 1,
    "parent": 195
  },
  {
    "name": "@libelle",
    "type": "attribute",
    "value": "Individuels",
    "xpath": "tif:Clienteles/tif:DetailClienteles/@libelle",
    "minOccurs": 1,
    "maxOccurs": 1,
    "parent": 285
  },
  {
    "name": "@xml:lang",
    "type": "attribute",
    "value": "FR",
    "xpath": "tif:Capacites/tif:CapacitesGlobales/tif:Superficie/@xml:lang",
    "minOccurs": 1,
    "maxOccurs": 1,
    "parent": 350
  },
  {
    "name": "@identifier",
    "type": "attribute",
    "value": "TFO027345813174",
    "xpath": "tif:PrestationsLiees/tif:DetailPrestationLiee/@identifier",
    "minOccurs": 1,
    "maxOccurs": 1,
    "parent": 225
  },
  {
    "name": "tif:AccessibilitePMR",
    "type": "element",
    "value": "N",
    "xpath": "tif:Capacites/tif:CapacitesUnites/tif:DetailCapaciteUnite/tif:AccessibilitePMR",
    "minOccurs": 0,
    "maxOccurs": 1,
    "parent": 40
  },
  {
    "name": "tif:Civilite",
    "type": "element",
    "value": "Monsieur",
    "xpath": "tif:Contacts/tif:DetailContact/tif:DetailContact/tif:Adresses/tif:DetailAdresse/tif:Personnes/tif:DetailPersonne/tif:Civilite",
    "minOccurs": 1,
    "maxOccurs": 1,
    "parent": 324
  },
  {
    "name": "tif:DetailMoyenCom",
    "type": "element",
    "xpath": "tif:Contacts/tif:DetailContact/tif:Adresses/tif:DetailAdresse/tif:Personnes/tif:DetailPersonne/tif:MoyensCommunications/tif:DetailMoyenCom",
    "minOccurs": 1,
    "maxOccurs": 8,
    "parent": 319
  },
  {
    "name": "tif:Payant",
    "type": "element",
    "value": "N",
    "xpath": "tif:OffresPrestations/tif:DetailOffrePrestation/tif:DetailPrestation/tif:Payant",
    "minOccurs": 0,
    "maxOccurs": 1,
    "parent": 369
  },
  {
    "name": "@type",
    "type": "attribute",
    "value": "14.02.37",
    "xpath": "tif:Capacites/tif:CapacitesPrestations/tif:DetailCapacitePrestation/@type",
    "minOccurs": 1,
    "maxOccurs": 1,
    "parent": 21
  },
  {
    "name": "tif:DetailMoments",
    "type": "element",
    "xpath": "tif:Periodes/tif:DetailPeriode/tif:Dates/tif:DetailDates/tif:Jours/tif:DetailJours/tif:Jour/tif:Moments/tif:DetailMoments",
    "minOccurs": 0,
    "maxOccurs": 1,
    "empty": true,
    "parent": 198
  },
  {
    "name": "tif:Moments",
    "type": "element",
    "xpath": "tif:Periodes/tif:DetailPeriode/tif:Dates/tif:DetailDates/tif:Moments",
    "minOccurs": 0,
    "maxOccurs": 1,
    "empty": true,
    "parent": 67
  },
  {
    "name": "@libelle",
    "type": "attribute",
    "value": "ha",
    "xpath": "tif:Capacites/tif:CapacitesPrestations/tif:DetailCapacitePrestation/tif:Superficie/@libelle",
    "minOccurs": 1,
    "maxOccurs": 1,
    "parent": 336
  },
  {
    "name": "@id",
    "type": "attribute",
    "value": "1",
    "xpath": "tif:Classements/tif:DetailClassement/@id",
    "minOccurs": 1,
    "maxOccurs": 1,
    "parent": 208
  },
  {
    "name": "tif:Distance",
    "type": "element",
    "value": "0",
    "xpath": "tif:OffresPrestations/tif:DetailOffrePrestation/tif:DetailPrestation/tif:Distance",
    "minOccurs": 0,
    "maxOccurs": 1,
    "parent": 369
  },
  {
    "name": "@type",
    "type": "attribute",
    "value": "08.02.07.02",
    "xpath": "tif:Contacts/tif:DetailContact/tif:Adresses/tif:DetailAdresse/tif:DetailGeolocalisation/tif:Zone/@type",
    "minOccurs": 1,
    "maxOccurs": 1,
    "parent": 23
  },
  {
    "name": "@type",
    "type": "attribute",
    "value": "04.04.05",
    "xpath": "tif:Contacts/tif:DetailContact/tif:DetailContact/tif:Adresses/tif:DetailAdresse/tif:Personnes/tif:DetailPersonne/@type",
    "minOccurs": 1,
    "maxOccurs": 1,
    "parent": 324
  },
  {
    "name": "dcterms:created",
    "type": "element",
    "value": "08-08-22",
    "xpath": "tif:DublinCore/dcterms:created",
    "minOccurs": 0,
    "maxOccurs": 1,
    "parent": 316
  },
  {
    "name": "sy:updateFrequency",
    "type": "element",
    "value": "1",
    "xpath": "tif:Update/sy:updateFrequency",
    "minOccurs": 0,
    "maxOccurs": 1,
    "parent": 338
  },
  {
    "name": "@type",
    "type": "attribute",
    "value": "13.04.03.99",
    "xpath": "tif:TarifsN1/tif:DetailTarifs/tif:DetailTarif/@type",
    "minOccurs": 1,
    "maxOccurs": 1,
    "parent": 323
  },
  {
    "name": "tif:DetailPeriode",
    "type": "element",
    "xpath": "tif:Periodes/tif:DetailPeriode",
    "minOccurs": 1,
    "maxOccurs": 50,
    "parent": 375
  },
  {
    "name": "tif:Nom",
    "type": "element",
    "value": "Midi-Pyrénées",
    "xpath": "tif:Geolocalisations/tif:DetailGeolocalisation/tif:Zone/tif:Nom",
    "minOccurs": 0,
    "maxOccurs": 1,
    "parent": 220
  },
  {
    "name": "tif:Personnes",
    "type": "element",
    "xpath": "tif:Contacts/tif:DetailContact/tif:DetailContact/tif:Adresses/tif:DetailAdresse/tif:Personnes",
    "minOccurs": 1,
    "maxOccurs": 1,
    "parent": 207
  },
  {
    "name": "tif:Prenom",
    "type": "element",
    "value": "Aline",
    "xpath": "tif:Contacts/tif:DetailContact/tif:Adresses/tif:DetailAdresse/tif:Personnes/tif:DetailPersonne/tif:Prenom",
    "minOccurs": 0,
    "maxOccurs": 1,
    "parent": 259
  },
  {
    "name": "tif:OffresPrestations",
    "type": "element",
    "xpath": "tif:OffresPrestations",
    "minOccurs": 1,
    "maxOccurs": 1
  },
  {
    "name": "tif:ModePaiement",
    "type": "element",
    "value": "Chèque",
    "xpath": "tif:Tarifs/tif:ModesPaiement/tif:ModePaiement",
    "minOccurs": 0,
    "maxOccurs": 11,
    "parent": 41
  },
  {
    "name": "tif:LegendeRessource",
    "type": "element",
    "value": "Moulins de Roupeyrac - Musée François Fabié",
    "xpath": "tif:Multimedia/tif:DetailMultimedia/tif:LegendeRessource",
    "minOccurs": 0,
    "maxOccurs": 2,
    "parent": 309
  },
  {
    "name": "tif:Pays",
    "type": "element",
    "value": "FRANCE",
    "xpath": "tif:Contacts/tif:DetailContact/tif:Adresses/tif:DetailAdresse/tif:Pays",
    "minOccurs": 0,
    "maxOccurs": 1,
    "parent": 272
  },
  {
    "name": "dc:title",
    "type": "element",
    "value": "Les Moulins de Roupeyrac - Maison d\u0027Ecrivain François Fabié",
    "xpath": "tif:DublinCore/dc:title",
    "minOccurs": 1,
    "maxOccurs": 4,
    "parent": 316
  },
  {
    "name": "@xml:lang",
    "type": "attribute",
    "value": "FR",
    "xpath": "tif:PrestationsLiees/tif:DetailPrestationLiee/@xml:lang",
    "minOccurs": 1,
    "maxOccurs": 1,
    "parent": 225
  },
  {
    "name": "@type",
    "type": "attribute",
    "value": "13.03.03",
    "xpath": "tif:Tarifs/tif:DetailTarifs/tif:DetailTarif/tif:TarifMode/@type",
    "minOccurs": 1,
    "maxOccurs": 1,
    "parent": 317
  },
  {
    "name": "tif:CodePostal",
    "type": "element",
    "value": "12210",
    "xpath": "tif:Contacts/tif:DetailContact/tif:DetailContact/tif:Adresses/tif:DetailAdresse/tif:CodePostal",
    "minOccurs": 1,
    "maxOccurs": 1,
    "parent": 207
  },
  {
    "name": "tif:HoraireDebut",
    "type": "element",
    "value": "10:30",
    "xpath": "tif:Periodes/tif:DetailPeriode/tif:Dates/tif:DetailDates/tif:Jours/tif:DetailJours/tif:Jour/tif:Horaires/tif:DetailHoraire/tif:HoraireDebut",
    "minOccurs": 0,
    "maxOccurs": 1,
    "parent": 373
  },
  {
    "name": "@libelle",
    "type": "attribute",
    "value": "Téléphone",
    "xpath": "tif:ModesReservations/tif:DetailModeReservation/tif:Contacts/tif:DetailContact/tif:Adresses/tif:DetailAdresse/tif:Personnes/tif:DetailPersonne/tif:MoyensCommunications/tif:DetailMoyenCom/@libelle",
    "minOccurs": 1,
    "maxOccurs": 1,
    "parent": 217
  },
  {
    "name": "@libelle",
    "type": "attribute",
    "value": "Tous les jours",
    "xpath": "tif:Periodes/tif:DetailPeriode/tif:Dates/tif:DetailDates/tif:Jours/tif:DetailJours/tif:Jour/@libelle",
    "minOccurs": 1,
    "maxOccurs": 1,
    "parent": 254
  },
  {
    "name": "tif:TypeMime",
    "type": "element",
    "value": "image/jpeg",
    "xpath": "tif:Multimedia/tif:DetailMultimedia/tif:TypeMime",
    "minOccurs": 0,
    "maxOccurs": 1,
    "parent": 309
  },
  {
    "name": "@code",
    "type": "attribute",
    "value": "FR",
    "xpath": "tif:Contacts/tif:DetailContact/tif:Adresses/tif:DetailAdresse/tif:Pays/@code",
    "minOccurs": 1,
    "maxOccurs": 1,
    "parent": 171
  },
  {
    "name": "tif:Contacts",
    "type": "element",
    "xpath": "tif:ModesReservations/tif:DetailModeReservation/tif:Contacts",
    "minOccurs": 0,
    "maxOccurs": 1,
    "parent": 256
  },
  {
    "name": "@code",
    "type": "attribute",
    "value": "12092",
    "xpath": "tif:Contacts/tif:DetailContact/tif:Adresses/tif:DetailAdresse/tif:Commune/@code",
    "minOccurs": 1,
    "maxOccurs": 1,
    "parent": 318
  },
  {
    "name": "tif:AgeMin",
    "type": "element",
    "value": "0",
    "xpath": "tif:Clienteles/tif:DetailClienteles/tif:DetailClient/tif:AgeMin",
    "minOccurs": 1,
    "maxOccurs": 1,
    "parent": 27
  },
  {
    "name": "tif:Classements",
    "type": "element",
    "xpath": "tif:Classements",
    "minOccurs": 1,
    "maxOccurs": 1
  },
  {
    "name": "tif:Usage",
    "type": "element",
    "xpath": "tif:Langues/tif:Usage",
    "minOccurs": 1,
    "maxOccurs": 7,
    "parent": 306
  },
  {
    "name": "tif:Nom",
    "type": "element",
    "value": "IZAC",
    "xpath": "tif:Contacts/tif:DetailContact/tif:DetailContact/tif:Adresses/tif:DetailAdresse/tif:Personnes/tif:DetailPersonne/tif:Nom",
    "minOccurs": 1,
    "maxOccurs": 1,
    "parent": 324
  },
  {
    "name": "@libelle",
    "type": "attribute",
    "value": "Moyen de communication",
    "xpath": "tif:Contacts/tif:DetailContact/tif:Adresses/tif:DetailAdresse/tif:Personnes/tif:DetailPersonne/@libelle",
    "minOccurs": 1,
    "maxOccurs": 1,
    "parent": 259
  },
  {
    "name": "@libelle",
    "type": "attribute",
    "value": "Tout public",
    "xpath": "tif:Clienteles/tif:DetailClienteles/tif:DetailClient/@libelle",
    "minOccurs": 1,
    "maxOccurs": 1,
    "parent": 27
  },
  {
    "name": "tif:GroupeRef",
    "type": "element",
    "value": "O",
    "xpath": "tif:Clienteles/tif:DetailClienteles/tif:DetailClient/tif:GroupeRef",
    "minOccurs": 1,
    "maxOccurs": 1,
    "parent": 27
  },
  {
    "name": "tif:CapaciteMaxi",
    "type": "element",
    "value": "0",
    "xpath": "tif:Capacites/tif:CapacitesUnites/tif:DetailCapaciteUnite/tif:Dispositions/tif:DetailDisposition/tif:CapaciteMaxi",
    "minOccurs": 0,
    "maxOccurs": 1,
    "parent": 3
  },
  {
    "name": "dcterms:abstract",
    "type": "element",
    "value": "Classement : - 4 chambre(s) - Capacité conseillée : 8 personnes (maximum : 10 pers.)Surface totale : 126 m² - Altitude : 250 m - Rénové le : 01-01-2006 - Animaux acceptés",
    "xpath": "tif:DublinCore/dcterms:abstract",
    "minOccurs": 0,
    "maxOccurs": 1,
    "parent": 316
  },
  {
    "name": "tif:Capacites",
    "type": "element",
    "xpath": "tif:Capacites",
    "minOccurs": 1,
    "maxOccurs": 1
  },
  {
    "name": "@type",
    "type": "attribute",
    "value": "04.04.05",
    "xpath": "tif:Contacts/tif:DetailContact/tif:Adresses/tif:DetailAdresse/tif:Personnes/tif:DetailPersonne/@type",
    "minOccurs": 1,
    "maxOccurs": 1,
    "parent": 259
  },
  {
    "name": "@xml:lang",
    "type": "attribute",
    "value": "FR",
    "xpath": "tif:Geolocalisations/tif:DetailGeolocalisation/tif:Zone/tif:Points/tif:DetailPoint/tif:Acces/tif:DetailAcces/@xml:lang",
    "minOccurs": 1,
    "maxOccurs": 1,
    "parent": 140
  },
  {
    "name": "tif:DetailContact",
    "type": "element",
    "value": "null",
    "xpath": "tif:Contacts/tif:DetailContact",
    "minOccurs": 1,
    "maxOccurs": 7,
    "parent": 15
  },
  {
    "name": "@type",
    "type": "attribute",
    "value": "06.98.06",
    "xpath": "tif:Classements/tif:DetailClassement/@type",
    "minOccurs": 1,
    "maxOccurs": 1,
    "parent": 208
  },
  {
    "name": "tif:Moment",
    "type": "element",
    "xpath": "tif:Periodes/tif:DetailPeriode/tif:Dates/tif:DetailDates/tif:Jours/tif:DetailJours/tif:Jour/tif:Moments/tif:DetailMoments/tif:Moment",
    "minOccurs": 1,
    "maxOccurs": 3,
    "empty": true,
    "parent": 154
  },
  {
    "name": "tif:Moments",
    "type": "element",
    "xpath": "tif:Periodes/tif:DetailPeriode/tif:Dates/tif:DetailDates/tif:Jours/tif:DetailJours/tif:Jour/tif:Moments",
    "minOccurs": 0,
    "maxOccurs": 1,
    "empty": true,
    "parent": 254
  },
  {
    "name": "@code",
    "type": "attribute",
    "value": "02.01.11",
    "xpath": "tif:DublinCore/tif:Classification/@code",
    "minOccurs": 1,
    "maxOccurs": 1,
    "parent": 18
  },
  {
    "name": "tif:DateFin",
    "type": "element",
    "value": "2017-10-31",
    "xpath": "tif:Periodes/tif:DetailPeriode/tif:Dates/tif:DetailDates/tif:DateFin",
    "minOccurs": 0,
    "maxOccurs": 1,
    "parent": 67
  },
  {
    "name": "tif:Clienteles",
    "type": "element",
    "xpath": "tif:Clienteles",
    "minOccurs": 1,
    "maxOccurs": 1
  },
  {
    "name": "tif:Distance",
    "type": "element",
    "value": "0.2",
    "xpath": "tif:Geolocalisations/tif:DetailGeolocalisation/tif:Zone/tif:Points/tif:DetailPoint/tif:Environnements/tif:DetailEnvironnement/tif:Distance",
    "minOccurs": 0,
    "maxOccurs": 1,
    "parent": 97
  },
  {
    "name": "@xml:lang",
    "type": "attribute",
    "value": "FR",
    "xpath": "tif:Geolocalisations/tif:DetailGeolocalisation/tif:Zone/@xml:lang",
    "minOccurs": 1,
    "maxOccurs": 1,
    "parent": 220
  },
  {
    "name": "@type",
    "type": "attribute",
    "value": "08.02.06.06",
    "xpath": "tif:Geolocalisations/tif:DetailGeolocalisation/tif:Zone/tif:Points/tif:DetailPoint/tif:Acces/tif:DetailAcces/@type",
    "minOccurs": 1,
    "maxOccurs": 1,
    "parent": 140
  },
  {
    "name": "tif:InformationsLegales",
    "type": "element",
    "xpath": "tif:InformationsLegales",
    "minOccurs": 1,
    "maxOccurs": 1
  },
  {
    "name": "tif:TarifMax",
    "type": "element",
    "value": "110",
    "xpath": "tif:TarifsN1/tif:DetailTarifs/tif:DetailTarif/tif:TarifMax",
    "minOccurs": 0,
    "maxOccurs": 1,
    "parent": 323
  },
  {
    "name": "tif:DetailAdresse",
    "type": "element",
    "xpath": "tif:Contacts/tif:DetailContact/tif:DetailContact/tif:Adresses/tif:DetailAdresse",
    "minOccurs": 1,
    "maxOccurs": 1,
    "parent": 352
  },
  {
    "name": "tif:DetailClassement",
    "type": "element",
    "xpath": "tif:Classements/tif:DetailClassement",
    "minOccurs": 1,
    "maxOccurs": 16,
    "parent": 184
  },
  {
    "name": "@type",
    "type": "attribute",
    "value": "12.01.01",
    "xpath": "tif:ModesReservations/tif:DetailModeReservation/@type",
    "minOccurs": 1,
    "maxOccurs": 1,
    "parent": 256
  },
  {
    "name": "@type",
    "type": "attribute",
    "value": "03.01.01",
    "xpath": "tif:Multimedia/tif:DetailMultimedia/@type",
    "minOccurs": 1,
    "maxOccurs": 1,
    "parent": 309
  },
  {
    "name": "@unite",
    "type": "attribute",
    "value": "01.03.04.02",
    "xpath": "tif:Capacites/tif:CapacitesGlobales/tif:Superficie/@unite",
    "minOccurs": 1,
    "maxOccurs": 1,
    "parent": 350
  },
  {
    "name": "@libelle",
    "type": "attribute",
    "value": "km",
    "xpath": "tif:OffresPrestations/tif:DetailOffrePrestation/tif:DetailPrestation/tif:Distance/@libelle",
    "minOccurs": 1,
    "maxOccurs": 1,
    "parent": 158
  },
  {
    "name": "@xml:lang",
    "type": "attribute",
    "value": "FR",
    "xpath": "tif:Capacites/tif:CapacitesUnites/tif:DetailCapaciteUnite/tif:Nom/@xml:lang",
    "minOccurs": 1,
    "maxOccurs": 1,
    "parent": 105
  },
  {
    "name": "dcterms:modified",
    "type": "element",
    "value": "17-05-30",
    "xpath": "tif:DublinCore/dcterms:modified",
    "minOccurs": 0,
    "maxOccurs": 1,
    "parent": 316
  },
  {
    "name": "tif:Distance",
    "type": "element",
    "value": "29",
    "xpath": "tif:Geolocalisations/tif:DetailGeolocalisation/tif:Zone/tif:Points/tif:DetailPoint/tif:Acces/tif:DetailAcces/tif:Distance",
    "minOccurs": 0,
    "maxOccurs": 1,
    "parent": 140
  },
  {
    "name": "@idref",
    "type": "attribute",
    "value": "id_prop_P00450",
    "xpath": "tif:ModesReservations/tif:DetailModeReservation/tif:Contacts/tif:DetailContact/@idref",
    "minOccurs": 1,
    "maxOccurs": 1,
    "parent": 79
  },
  {
    "name": "tif:DetailMoyenCom",
    "type": "element",
    "xpath": "tif:ModesReservations/tif:DetailModeReservation/tif:Contacts/tif:DetailContact/tif:Adresses/tif:DetailAdresse/tif:Personnes/tif:DetailPersonne/tif:MoyensCommunications/tif:DetailMoyenCom",
    "minOccurs": 8,
    "maxOccurs": 8,
    "empty": true,
    "parent": 286
  },
  {
    "name": "tif:Multimedia",
    "type": "element",
    "xpath": "tif:Multimedia",
    "minOccurs": 1,
    "maxOccurs": 1
  },
  {
    "name": "@type",
    "type": "attribute",
    "value": "08.02.07.02",
    "xpath": "tif:Geolocalisations/tif:DetailGeolocalisation/tif:Zone/@type",
    "minOccurs": 1,
    "maxOccurs": 1,
    "parent": 220
  },
  {
    "name": "tif:Zone",
    "type": "element",
    "xpath": "tif:Geolocalisations/tif:DetailGeolocalisation/tif:Zone",
    "minOccurs": 1,
    "maxOccurs": 1,
    "parent": 240
  },
  {
    "name": "@code",
    "type": "attribute",
    "value": "12092",
    "xpath": "tif:Geolocalisations/tif:DetailGeolocalisation/tif:Zone/tif:Points/tif:DetailPoint/tif:Commune/@code",
    "minOccurs": 1,
    "maxOccurs": 1,
    "parent": 325
  },
  {
    "name": "@classee",
    "type": "attribute",
    "value": "N",
    "xpath": "tif:Capacites/tif:CapacitesPrestations/tif:DetailCapacitePrestation/tif:Superficie/@classee",
    "minOccurs": 1,
    "maxOccurs": 1,
    "parent": 336
  },
  {
    "name": "@libelle",
    "type": "attribute",
    "value": "Identification",
    "xpath": "tif:DescriptionsComplementaires/tif:DetailDescriptionComplementaire/@libelle",
    "minOccurs": 1,
    "maxOccurs": 1,
    "parent": 19
  },
  {
    "name": "tif:DateDebut",
    "type": "element",
    "value": "2017-04-01",
    "xpath": "tif:Periodes/tif:DetailPeriode/tif:Dates/tif:DetailDates/tif:DateDebut",
    "minOccurs": 0,
    "maxOccurs": 1,
    "parent": 67
  },
  {
    "name": "tif:DetailPrestationLiee",
    "type": "element",
    "value": "Activités de pleine nature",
    "xpath": "tif:PrestationsLiees/tif:DetailPrestationLiee",
    "minOccurs": 0,
    "maxOccurs": 12,
    "parent": 299
  },
  {
    "name": "dc:identifier",
    "type": "element",
    "value": "TFO020259047335",
    "xpath": "tif:DublinCore/dc:identifier",
    "minOccurs": 1,
    "maxOccurs": 1,
    "parent": 316
  },
  {
    "name": "tif:DescriptionTarif",
    "type": "element",
    "value": "Gratuit pour les - de 26 ans",
    "xpath": "tif:Tarifs/tif:DetailTarifs/tif:DetailTarif/tif:DescriptionTarif",
    "minOccurs": 0,
    "maxOccurs": 3,
    "parent": 70
  },
  {
    "name": "@xml:lang",
    "type": "attribute",
    "value": "FR",
    "xpath": "tif:Geolocalisations/tif:DetailGeolocalisation/tif:Zone/tif:Points/tif:DetailPoint/tif:Acces/tif:DetailAcces/tif:ObservationDetailAcces/@xml:lang",
    "minOccurs": 1,
    "maxOccurs": 1,
    "parent": 131
  },
  {
    "name": "tif:Geolocalisations",
    "type": "element",
    "xpath": "tif:Geolocalisations",
    "minOccurs": 1,
    "maxOccurs": 2
  },
  {
    "name": "tif:SurfaceMoyenne",
    "type": "element",
    "value": "0",
    "xpath": "tif:Capacites/tif:CapacitesUnites/tif:DetailCapaciteUnite/tif:SurfaceMoyenne",
    "minOccurs": 0,
    "maxOccurs": 1,
    "parent": 40
  },
  {
    "name": "@xml:lang",
    "type": "attribute",
    "value": "FR",
    "xpath": "tif:DescriptionsComplementaires/tif:DetailDescriptionComplementaire/tif:Description/@xml:lang",
    "minOccurs": 1,
    "maxOccurs": 1,
    "parent": 332
  },
  {
    "name": "tif:Tarifs",
    "type": "element",
    "xpath": "tif:Tarifs",
    "minOccurs": 1,
    "maxOccurs": 1
  },
  {
    "name": "@xml:lang",
    "type": "attribute",
    "value": "FR",
    "xpath": "tif:Periodes/tif:DetailPeriode/tif:ObservationDetailPeriode/@xml:lang",
    "minOccurs": 1,
    "maxOccurs": 1,
    "parent": 42
  },
  {
    "name": "tif:DescriptionsComplementaires",
    "type": "element",
    "xpath": "tif:DescriptionsComplementaires",
    "minOccurs": 1,
    "maxOccurs": 1
  },
  {
    "name": "@libelle",
    "type": "attribute",
    "value": "Indéterminée",
    "xpath": "tif:Capacites/tif:CapacitesUnites/tif:DetailCapaciteUnite/tif:Dispositions/tif:DetailDisposition/@libelle",
    "minOccurs": 1,
    "maxOccurs": 1,
    "parent": 3
  },
  {
    "name": "tif:Personnes",
    "type": "element",
    "xpath": "tif:ModesReservations/tif:DetailModeReservation/tif:Contacts/tif:DetailContact/tif:Adresses/tif:DetailAdresse/tif:Personnes",
    "minOccurs": 1,
    "maxOccurs": 1,
    "empty": true,
    "parent": 349
  },
  {
    "name": "@xml:lang",
    "type": "attribute",
    "value": "FR",
    "xpath": "tif:Geolocalisations/tif:DetailGeolocalisation/tif:Zone/tif:Points/tif:DetailPoint/tif:Environnements/tif:DetailEnvironnement/@xml:lang",
    "minOccurs": 1,
    "maxOccurs": 1,
    "parent": 97
  },
  {
    "name": "tif:RaisonSociale",
    "type": "element",
    "value": "Les Moulins de Roupeyrac - Maison d\u0027Ecrivain François Fabié",
    "xpath": "tif:Contacts/tif:DetailContact/tif:RaisonSociale",
    "minOccurs": 0,
    "maxOccurs": 1,
    "parent": 195
  },
  {
    "name": "tif:Environnements",
    "type": "element",
    "xpath": "tif:Geolocalisations/tif:DetailGeolocalisation/tif:Zone/tif:Points/tif:DetailPoint/tif:Environnements",
    "minOccurs": 0,
    "maxOccurs": 1,
    "parent": 127
  },
  {
    "name": "tif:DetailGeolocalisation",
    "type": "element",
    "xpath": "tif:Geolocalisations/tif:DetailGeolocalisation",
    "minOccurs": 1,
    "maxOccurs": 1,
    "parent": 229
  },
  {
    "name": "@type",
    "type": "attribute",
    "value": "08.01.03",
    "xpath": "tif:Geolocalisations/tif:DetailGeolocalisation/@type",
    "minOccurs": 1,
    "maxOccurs": 1,
    "parent": 240
  },
  {
    "name": "@xml:lang",
    "type": "attribute",
    "value": "FR",
    "xpath": "tif:Geolocalisations/tif:DetailGeolocalisation/tif:Zone/tif:Points/tif:DetailPoint/tif:Environnements/tif:DetailEnvironnement/tif:ObservationDetailEnvironnement/@xml:lang",
    "minOccurs": 1,
    "maxOccurs": 1,
    "parent": 25
  },
  {
    "name": "tif:DetailGeolocalisation",
    "type": "element",
    "xpath": "tif:Contacts/tif:DetailContact/tif:Adresses/tif:DetailAdresse/tif:DetailGeolocalisation",
    "minOccurs": 0,
    "maxOccurs": 1,
    "parent": 272
  },
  {
    "name": "tif:Nom",
    "type": "element",
    "value": "Durenque",
    "xpath": "tif:Geolocalisations/tif:DetailGeolocalisation/tif:Zone/tif:Points/tif:DetailPoint/tif:Environnements/tif:DetailEnvironnement/tif:Nom",
    "minOccurs": 0,
    "maxOccurs": 1,
    "parent": 97
  },
  {
    "name": "sy:updatePeriod",
    "type": "element",
    "value": "yearly",
    "xpath": "tif:Update/sy:updatePeriod",
    "minOccurs": 0,
    "maxOccurs": 1,
    "parent": 338
  },
  {
    "name": "@type",
    "type": "attribute",
    "value": "16.01.05",
    "xpath": "tif:DescriptionsComplementaires/tif:DetailDescriptionComplementaire/@type",
    "minOccurs": 1,
    "maxOccurs": 1,
    "parent": 19
  },
  {
    "name": "tif:NbPrest",
    "type": "element",
    "value": "1",
    "xpath": "tif:OffresPrestations/tif:DetailOffrePrestation/tif:DetailPrestation/tif:NbPrest",
    "minOccurs": 0,
    "maxOccurs": 1,
    "parent": 369
  },
  {
    "name": "@libelle",
    "type": "attribute",
    "value": "Moyen de communication",
    "xpath": "tif:ModesReservations/tif:DetailModeReservation/tif:Contacts/tif:DetailContact/tif:Adresses/tif:DetailAdresse/tif:Personnes/tif:DetailPersonne/@libelle",
    "minOccurs": 1,
    "maxOccurs": 1,
    "parent": 326
  },
  {
    "name": "@type",
    "type": "attribute",
    "value": "04.04.05",
    "xpath": "tif:ModesReservations/tif:DetailModeReservation/tif:Contacts/tif:DetailContact/tif:Adresses/tif:DetailAdresse/tif:Personnes/tif:DetailPersonne/@type",
    "minOccurs": 1,
    "maxOccurs": 1,
    "parent": 326
  },
  {
    "name": "@type",
    "type": "attribute",
    "value": "11.01.01",
    "xpath": "tif:Langues/tif:Usage/@type",
    "minOccurs": 1,
    "maxOccurs": 1,
    "parent": 185
  },
  {
    "name": "tif:DetailPeriode",
    "type": "element",
    "xpath": "tif:Tarifs/tif:DetailTarifs/tif:DetailTarif/tif:DetailPeriode",
    "minOccurs": 0,
    "maxOccurs": 1,
    "parent": 70
  },
  {
    "name": "@unite",
    "type": "attribute",
    "value": "01.03.02.01",
    "xpath": "tif:Geolocalisations/tif:DetailGeolocalisation/tif:Zone/tif:Points/tif:DetailPoint/tif:Environnements/tif:DetailEnvironnement/tif:Distance/@unite",
    "minOccurs": 1,
    "maxOccurs": 1,
    "parent": 202
  },
  {
    "name": "tif:ObservationModePaiement",
    "type": "element",
    "value": "et espèces",
    "xpath": "tif:Tarifs/tif:ModesPaiement/tif:ObservationModePaiement",
    "minOccurs": 0,
    "maxOccurs": 1,
    "parent": 41
  },
  {
    "name": "tif:Jour",
    "type": "element",
    "xpath": "tif:Periodes/tif:DetailPeriode/tif:Dates/tif:DetailDates/tif:Jours/tif:DetailJours/tif:Jour",
    "minOccurs": 0,
    "maxOccurs": 9,
    "parent": 31
  },
  {
    "name": "@code",
    "type": "attribute",
    "value": "FR",
    "xpath": "tif:ModesReservations/tif:DetailModeReservation/tif:Contacts/tif:DetailContact/tif:Adresses/tif:DetailAdresse/tif:Pays/@code",
    "minOccurs": 1,
    "maxOccurs": 1,
    "parent": 269
  },
  {
    "name": "tif:DetailModeReservation",
    "type": "element",
    "xpath": "tif:ModesReservations/tif:DetailModeReservation",
    "minOccurs": 1,
    "maxOccurs": 1,
    "parent": 108
  },
  {
    "name": "@libelle",
    "type": "attribute",
    "value": "m2",
    "xpath": "tif:Capacites/tif:CapacitesUnites/tif:DetailCapaciteUnite/tif:SurfaceMoyenne/@libelle",
    "minOccurs": 1,
    "maxOccurs": 1,
    "parent": 230
  },
  {
    "name": "dc:contributor",
    "type": "element",
    "value": "Comité Départemental du Tourisme de l\u0027Aveyron",
    "xpath": "tif:DublinCore/dc:contributor",
    "minOccurs": 0,
    "maxOccurs": 1,
    "parent": 316
  },
  {
    "name": "tif:DetailPersonne",
    "type": "element",
    "xpath": "tif:Contacts/tif:DetailContact/tif:Adresses/tif:DetailAdresse/tif:Personnes/tif:DetailPersonne",
    "minOccurs": 1,
    "maxOccurs": 3,
    "parent": 290
  },
  {
    "name": "@type",
    "type": "attribute",
    "value": "04.02.01",
    "xpath": "tif:ModesReservations/tif:DetailModeReservation/tif:Contacts/tif:DetailContact/tif:Adresses/tif:DetailAdresse/tif:Personnes/tif:DetailPersonne/tif:MoyensCommunications/tif:DetailMoyenCom/@type",
    "minOccurs": 1,
    "maxOccurs": 1,
    "parent": 217
  },
  {
    "name": "tif:Altitude",
    "type": "element",
    "value": "682",
    "xpath": "tif:Geolocalisations/tif:DetailGeolocalisation/tif:Zone/tif:Points/tif:DetailPoint/tif:Coordonnees/tif:DetailCoordonnees/tif:Altitude",
    "minOccurs": 0,
    "maxOccurs": 1,
    "parent": 75
  },
  {
    "name": "tif:Coord",
    "type": "element",
    "value": "+330565781885",
    "xpath": "tif:Contacts/tif:DetailContact/tif:Adresses/tif:DetailAdresse/tif:Personnes/tif:DetailPersonne/tif:MoyensCommunications/tif:DetailMoyenCom/tif:Coord",
    "minOccurs": 0,
    "maxOccurs": 1,
    "parent": 151
  },
  {
    "name": "tif:HoraireFin",
    "type": "element",
    "value": "13:00",
    "xpath": "tif:Periodes/tif:DetailPeriode/tif:Dates/tif:DetailDates/tif:Jours/tif:DetailJours/tif:Jour/tif:Horaires/tif:DetailHoraire/tif:HoraireFin",
    "minOccurs": 0,
    "maxOccurs": 1,
    "parent": 373
  },
  {
    "name": "tif:NumAgrementLicence",
    "type": "element",
    "value": "ISO 9001 : 2008 (AFAQ) \u003d 06/04/09 au 05/04/12",
    "xpath": "tif:InformationsLegales/tif:NumAgrementLicence",
    "minOccurs": 0,
    "maxOccurs": 1,
    "parent": 205
  },
  {
    "name": "tif:DetailMoyenCom",
    "type": "element",
    "xpath": "tif:Contacts/tif:DetailContact/tif:DetailContact/tif:Adresses/tif:DetailAdresse/tif:Personnes/tif:DetailPersonne/tif:MoyensCommunications/tif:DetailMoyenCom",
    "minOccurs": 6,
    "maxOccurs": 6,
    "empty": true,
    "parent": 339
  },
  {
    "name": "@type",
    "type": "attribute",
    "value": "09.01.08",
    "xpath": "tif:Tarifs/tif:DetailTarifs/tif:DetailTarif/tif:DetailPeriode/@type",
    "minOccurs": 1,
    "maxOccurs": 1,
    "parent": 251
  },
  {
    "name": "tif:ModeGestion",
    "type": "element",
    "value": "Associatif",
    "xpath": "tif:InformationsLegales/tif:ModeGestion",
    "minOccurs": 0,
    "maxOccurs": 1,
    "parent": 205
  },
  {
    "name": "tif:Nom",
    "type": "element",
    "value": "Chambre double sans petit déjeuner",
    "xpath": "tif:TarifsN1/tif:DetailTarifs/tif:DetailTarif/tif:Nom",
    "minOccurs": 0,
    "maxOccurs": 1,
    "parent": 323
  },
  {
    "name": "tif:Pays",
    "type": "element",
    "value": "FRANCE",
    "xpath": "tif:ModesReservations/tif:DetailModeReservation/tif:Contacts/tif:DetailContact/tif:Adresses/tif:DetailAdresse/tif:Pays",
    "minOccurs": 1,
    "maxOccurs": 1,
    "parent": 349
  },
  {
    "name": "@type",
    "type": "attribute",
    "value": "04.02.01",
    "xpath": "tif:Contacts/tif:DetailContact/tif:DetailContact/tif:Adresses/tif:DetailAdresse/tif:Personnes/tif:DetailPersonne/tif:MoyensCommunications/tif:DetailMoyenCom/@type",
    "minOccurs": 1,
    "maxOccurs": 1,
    "parent": 265
  },
  {
    "name": "@code",
    "type": "attribute",
    "value": "12119",
    "xpath": "tif:Contacts/tif:DetailContact/tif:DetailContact/tif:Adresses/tif:DetailAdresse/tif:Commune/@code",
    "minOccurs": 1,
    "maxOccurs": 1,
    "parent": 305
  },
  {
    "name": "tif:DetailAdresse",
    "type": "element",
    "xpath": "tif:Contacts/tif:DetailContact/tif:Adresses/tif:DetailAdresse",
    "minOccurs": 1,
    "maxOccurs": 2,
    "parent": 145
  },
  {
    "name": "@xml:lang",
    "type": "attribute",
    "value": "FR",
    "xpath": "tif:TarifsN1/tif:DetailTarifs/tif:DetailTarif/tif:DescriptionTarif/@xml:lang",
    "minOccurs": 1,
    "maxOccurs": 1,
    "parent": 387
  },
  {
    "name": "@libelle",
    "type": "attribute",
    "value": "Informations complémentaires",
    "xpath": "tif:DescriptionsComplementaires/tif:DetailDescriptionComplementaire/tif:Description/@libelle",
    "minOccurs": 1,
    "maxOccurs": 1,
    "parent": 332
  },
  {
    "name": "tif:Adresses",
    "type": "element",
    "xpath": "tif:ModesReservations/tif:DetailModeReservation/tif:Contacts/tif:DetailContact/tif:Adresses",
    "minOccurs": 1,
    "maxOccurs": 1,
    "parent": 79
  },
  {
    "name": "tif:TarifRef",
    "type": "element",
    "value": "N",
    "xpath": "tif:Tarifs/tif:DetailTarifs/tif:DetailTarif/tif:TarifRef",
    "minOccurs": 0,
    "maxOccurs": 1,
    "parent": 70
  },
  {
    "name": "@libelle",
    "type": "attribute",
    "value": "Accès handicapés",
    "xpath": "tif:Capacites/tif:CapacitesPrestations/tif:DetailCapacitePrestation/@libelle",
    "minOccurs": 1,
    "maxOccurs": 1,
    "parent": 21
  },
  {
    "name": "tif:DescriptionPrestation",
    "type": "element",
    "value": "300m - possibilité dépose devant l\u0027établissement",
    "xpath": "tif:OffresPrestations/tif:DetailOffrePrestation/tif:DetailPrestation/tif:DescriptionPrestation",
    "minOccurs": 0,
    "maxOccurs": 1,
    "parent": 369
  },
  {
    "name": "@type",
    "type": "attribute",
    "value": "09.01.06",
    "xpath": "tif:Periodes/tif:DetailPeriode/@type",
    "minOccurs": 1,
    "maxOccurs": 1,
    "parent": 164
  },
  {
    "name": "tif:Longitude",
    "type": "element",
    "value": "2.6211038692792954",
    "xpath": "tif:Geolocalisations/tif:DetailGeolocalisation/tif:Zone/tif:Points/tif:DetailPoint/tif:Coordonnees/tif:DetailCoordonnees/tif:Longitude",
    "minOccurs": 1,
    "maxOccurs": 1,
    "parent": 75
  },
  {
    "name": "tif:NbPersMin",
    "type": "element",
    "value": "0",
    "xpath": "tif:Clienteles/tif:DetailClienteles/tif:DetailClient/tif:NbPersMin",
    "minOccurs": 1,
    "maxOccurs": 1,
    "parent": 27
  },
  {
    "name": "@libelle",
    "type": "attribute",
    "value": "Téléphone",
    "xpath": "tif:Contacts/tif:DetailContact/tif:DetailContact/tif:Adresses/tif:DetailAdresse/tif:Personnes/tif:DetailPersonne/tif:MoyensCommunications/tif:DetailMoyenCom/@libelle",
    "minOccurs": 1,
    "maxOccurs": 1,
    "parent": 265
  },
  {
    "name": "@xml:lang",
    "type": "attribute",
    "value": "FR",
    "xpath": "tif:DescriptionsComplementaires/tif:DetailDescriptionComplementaire/@xml:lang",
    "minOccurs": 1,
    "maxOccurs": 1,
    "parent": 19
  },
  {
    "name": "@type",
    "type": "attribute",
    "value": "13.03.01",
    "xpath": "tif:TarifsN1/tif:DetailTarifs/tif:DetailTarif/tif:TarifMode/@type",
    "minOccurs": 1,
    "maxOccurs": 1,
    "parent": 38
  },
  {
    "name": "tif:DetailClienteles",
    "type": "element",
    "xpath": "tif:Clienteles/tif:DetailClienteles",
    "minOccurs": 0,
    "maxOccurs": 3,
    "parent": 201
  },
  {
    "name": "tif:MoyensCommunications",
    "type": "element",
    "xpath": "tif:ModesReservations/tif:DetailModeReservation/tif:Contacts/tif:DetailContact/tif:Adresses/tif:DetailAdresse/tif:Personnes/tif:DetailPersonne/tif:MoyensCommunications",
    "minOccurs": 1,
    "maxOccurs": 1,
    "empty": true,
    "parent": 326
  },
  {
    "name": "@unite",
    "type": "attribute",
    "value": "01.03.04.02",
    "xpath": "tif:Capacites/tif:CapacitesPrestations/tif:DetailCapacitePrestation/tif:Superficie/@unite",
    "minOccurs": 1,
    "maxOccurs": 1,
    "parent": 336
  },
  {
    "name": "dc:publisher",
    "type": "element",
    "value": "Comité Départemenal du Tourisme de l\u0027Aveyron",
    "xpath": "tif:DublinCore/dc:publisher",
    "minOccurs": 0,
    "maxOccurs": 1,
    "parent": 316
  },
  {
    "name": "@type",
    "type": "attribute",
    "value": "04.01.01",
    "xpath": "tif:Contacts/tif:DetailContact/tif:Adresses/tif:DetailAdresse/tif:Personnes/tif:DetailPersonne/tif:Civilite/@type",
    "minOccurs": 1,
    "maxOccurs": 1,
    "parent": 72
  },
  {
    "name": "tif:Personnes",
    "type": "element",
    "xpath": "tif:Contacts/tif:DetailContact/tif:Adresses/tif:DetailAdresse/tif:Personnes",
    "minOccurs": 0,
    "maxOccurs": 1,
    "parent": 272
  },
  {
    "name": "@libelle",
    "type": "attribute",
    "value": "Propriétaire",
    "xpath": "tif:ModesReservations/tif:DetailModeReservation/tif:Contacts/tif:DetailContact/@libelle",
    "minOccurs": 1,
    "maxOccurs": 1,
    "parent": 79
  },
  {
    "name": "@libelle",
    "type": "attribute",
    "value": "Centrale",
    "xpath": "tif:ModesReservations/tif:DetailModeReservation/@libelle",
    "minOccurs": 1,
    "maxOccurs": 1,
    "parent": 256
  },
  {
    "name": "@id",
    "type": "attribute",
    "value": "1",
    "xpath": "tif:Clienteles/tif:DetailClienteles/tif:DetailClient/@id",
    "minOccurs": 1,
    "maxOccurs": 1,
    "parent": 27
  },
  {
    "name": "@type",
    "type": "attribute",
    "value": "06.98.01.OT12197.01",
    "xpath": "tif:Classements/tif:DetailClassement/tif:Classement/@type",
    "minOccurs": 1,
    "maxOccurs": 1,
    "parent": 313
  },
  {
    "name": "tif:RCS",
    "type": "element",
    "value": "SARL",
    "xpath": "tif:InformationsLegales/tif:RCS",
    "minOccurs": 0,
    "maxOccurs": 1,
    "parent": 205
  },
  {
    "name": "@lib_moment",
    "type": "attribute",
    "value": "09.04.03",
    "xpath": "tif:Periodes/tif:DetailPeriode/tif:Dates/tif:DetailDates/tif:Jours/tif:DetailJours/tif:Jour/tif:Moments/tif:DetailMoments/tif:Moment/@lib_moment",
    "minOccurs": 1,
    "maxOccurs": 1,
    "parent": 197
  },
  {
    "name": "tif:Nom",
    "type": "element",
    "value": "Individuels tout public",
    "xpath": "tif:Clienteles/tif:DetailClienteles/tif:DetailClient/tif:Nom",
    "minOccurs": 0,
    "maxOccurs": 1,
    "parent": 27
  },
  {
    "name": "@libelle",
    "type": "attribute",
    "value": "Zone",
    "xpath": "tif:Contacts/tif:DetailContact/tif:Adresses/tif:DetailAdresse/tif:DetailGeolocalisation/@libelle",
    "minOccurs": 1,
    "maxOccurs": 1,
    "parent": 243
  },
  {
    "name": "tif:PrestationsLiees",
    "type": "element",
    "xpath": "tif:PrestationsLiees",
    "minOccurs": 1,
    "maxOccurs": 1
  },
  {
    "name": "@unite",
    "type": "attribute",
    "value": "01.03.04.01",
    "xpath": "tif:Capacites/tif:CapacitesUnites/tif:DetailCapaciteUnite/tif:SurfaceMoyenne/@unite",
    "minOccurs": 1,
    "maxOccurs": 1,
    "parent": 230
  },
  {
    "name": "tif:moments",
    "type": "element",
    "xpath": "tif:Periodes/tif:DetailPeriode/tif:Dates/tif:DetailDates/tif:Jours/tif:DetailJours/tif:Jour/tif:moments",
    "minOccurs": 0,
    "maxOccurs": 4,
    "empty": true,
    "parent": 254
  },
  {
    "name": "tif:CapacitesPrestations",
    "type": "element",
    "xpath": "tif:Capacites/tif:CapacitesPrestations",
    "minOccurs": 0,
    "maxOccurs": 1,
    "parent": 192
  },
  {
    "name": "tif:CodePostal",
    "type": "element",
    "value": "12170",
    "xpath": "tif:Contacts/tif:DetailContact/tif:Adresses/tif:DetailAdresse/tif:CodePostal",
    "minOccurs": 0,
    "maxOccurs": 1,
    "parent": 272
  },
  {
    "name": "tif:DetailContact",
    "type": "element",
    "xpath": "tif:Contacts/tif:DetailContact/tif:DetailContact",
    "minOccurs": 0,
    "maxOccurs": 1,
    "parent": 195
  },
  {
    "name": "tif:Commune",
    "type": "element",
    "value": "Laguiole",
    "xpath": "tif:Contacts/tif:DetailContact/tif:DetailContact/tif:Adresses/tif:DetailAdresse/tif:Commune",
    "minOccurs": 1,
    "maxOccurs": 1,
    "parent": 207
  },
  {
    "name": "tif:Langues",
    "type": "element",
    "xpath": "tif:Langues",
    "minOccurs": 1,
    "maxOccurs": 2
  },
  {
    "name": "tif:Nom",
    "type": "element",
    "value": "Moulins de Roupeyrac - Musée François Fabié",
    "xpath": "tif:Multimedia/tif:DetailMultimedia/tif:Nom",
    "minOccurs": 0,
    "maxOccurs": 1,
    "parent": 309
  },
  {
    "name": "tif:DetailMoments",
    "type": "element",
    "xpath": "tif:Periodes/tif:DetailPeriode/tif:Dates/tif:DetailDates/tif:Moments/tif:DetailMoments",
    "minOccurs": 0,
    "maxOccurs": 1,
    "empty": true,
    "parent": 155
  },
  {
    "name": "tif:DetailMultimedia",
    "type": "element",
    "xpath": "tif:Multimedia/tif:DetailMultimedia",
    "minOccurs": 0,
    "maxOccurs": 36,
    "parent": 218
  },
  {
    "name": "tif:Nom",
    "type": "element",
    "value": "Parking",
    "xpath": "tif:OffresPrestations/tif:DetailOffrePrestation/tif:DetailPrestation/tif:Nom",
    "minOccurs": 0,
    "maxOccurs": 1,
    "parent": 369
  },
  {
    "name": "@type",
    "type": "attribute",
    "value": "15.05.64",
    "xpath": "tif:OffresPrestations/tif:DetailOffrePrestation/tif:DetailPrestation/tif:Prestation/@type",
    "minOccurs": 1,
    "maxOccurs": 1,
    "parent": 143
  },
  {
    "name": "@xml:lang",
    "type": "attribute",
    "value": "FR",
    "xpath": "tif:Capacites/tif:CapacitesUnites/tif:DetailCapaciteUnite/tif:DescriptionCapaciteUnite/@xml:lang",
    "minOccurs": 1,
    "maxOccurs": 1,
    "parent": 68
  },
  {
    "name": "tif:Classement",
    "type": "element",
    "value": "Classe 1",
    "xpath": "tif:Classements/tif:DetailClassement/tif:Classement",
    "minOccurs": 0,
    "maxOccurs": 1,
    "parent": 208
  },
  {
    "name": "dc:subject",
    "type": "element",
    "value": "Moulins de Roupeyrac. Maison natale du poète François Fabié - Maison d\u0027Ecrivain.",
    "xpath": "tif:DublinCore/dc:subject",
    "minOccurs": 0,
    "maxOccurs": 4,
    "parent": 316
  },
  {
    "name": "@classee",
    "type": "attribute",
    "value": "N",
    "xpath": "tif:Capacites/tif:CapacitesPrestations/tif:DetailCapacitePrestation/tif:Capacite/@classee",
    "minOccurs": 1,
    "maxOccurs": 1,
    "parent": 47
  },
  {
    "name": "tif:DublinCore",
    "type": "element",
    "xpath": "tif:DublinCore",
    "minOccurs": 1,
    "maxOccurs": 1
  },
  {
    "name": "tif:TarifMode",
    "type": "element",
    "value": "Par personne",
    "xpath": "tif:Tarifs/tif:DetailTarifs/tif:DetailTarif/tif:TarifMode",
    "minOccurs": 0,
    "maxOccurs": 1,
    "parent": 70
  },
  {
    "name": "tif:Commune",
    "type": "element",
    "value": "Durenque",
    "xpath": "tif:Contacts/tif:DetailContact/tif:Adresses/tif:DetailAdresse/tif:Commune",
    "minOccurs": 0,
    "maxOccurs": 1,
    "parent": 272
  },
  {
    "name": "tif:MoyensCommunications",
    "type": "element",
    "xpath": "tif:Contacts/tif:DetailContact/tif:Adresses/tif:DetailAdresse/tif:Personnes/tif:DetailPersonne/tif:MoyensCommunications",
    "minOccurs": 0,
    "maxOccurs": 1,
    "parent": 259
  },
  {
    "name": "@code",
    "type": "attribute",
    "value": "FR",
    "xpath": "tif:Contacts/tif:DetailContact/tif:DetailContact/tif:Adresses/tif:DetailAdresse/tif:Pays/@code",
    "minOccurs": 1,
    "maxOccurs": 1,
    "parent": 85
  },
  {
    "name": "tif:Commune",
    "type": "element",
    "value": "Durenque",
    "xpath": "tif:OffresPrestations/tif:DetailOffrePrestation/tif:DetailPrestation/tif:Commune",
    "minOccurs": 0,
    "maxOccurs": 1,
    "parent": 369
  },
  {
    "name": "@type",
    "type": "attribute",
    "value": "15.05",
    "xpath": "tif:OffresPrestations/tif:DetailOffrePrestation/@type",
    "minOccurs": 1,
    "maxOccurs": 1,
    "parent": 65
  },
  {
    "name": "tif:DetailTarif",
    "type": "element",
    "xpath": "tif:TarifsN1/tif:DetailTarifs/tif:DetailTarif",
    "minOccurs": 1,
    "maxOccurs": 12,
    "parent": 30
  },
  {
    "name": "tif:DetailPersonne",
    "type": "element",
    "xpath": "tif:Contacts/tif:DetailContact/tif:DetailContact/tif:Adresses/tif:DetailAdresse/tif:Personnes/tif:DetailPersonne",
    "minOccurs": 1,
    "maxOccurs": 1,
    "parent": 166
  },
  {
    "name": "tif:Commune",
    "type": "element",
    "value": "Durenque",
    "xpath": "tif:Geolocalisations/tif:DetailGeolocalisation/tif:Zone/tif:Points/tif:DetailPoint/tif:Commune",
    "minOccurs": 0,
    "maxOccurs": 1,
    "parent": 127
  },
  {
    "name": "tif:DetailPersonne",
    "type": "element",
    "xpath": "tif:ModesReservations/tif:DetailModeReservation/tif:Contacts/tif:DetailContact/tif:Adresses/tif:DetailAdresse/tif:Personnes/tif:DetailPersonne",
    "minOccurs": 1,
    "maxOccurs": 1,
    "empty": true,
    "parent": 236
  },
  {
    "name": "tif:Dispositions",
    "type": "element",
    "xpath": "tif:Capacites/tif:CapacitesUnites/tif:DetailCapaciteUnite/tif:Dispositions",
    "minOccurs": 0,
    "maxOccurs": 1,
    "parent": 40
  },
  {
    "name": "tif:DateFin",
    "type": "element",
    "value": "2011-01-01",
    "xpath": "tif:Tarifs/tif:DetailTarifs/tif:DetailTarif/tif:DetailPeriode/tif:Dates/tif:DetailDates/tif:DateFin",
    "minOccurs": 1,
    "maxOccurs": 1,
    "parent": 114
  },
  {
    "name": "@type",
    "type": "attribute",
    "value": "16.02.09",
    "xpath": "tif:DescriptionsComplementaires/tif:DetailDescriptionComplementaire/tif:Description/@type",
    "minOccurs": 1,
    "maxOccurs": 1,
    "parent": 332
  },
  {
    "name": "tif:Nom",
    "type": "element",
    "value": "Rodez",
    "xpath": "tif:Geolocalisations/tif:DetailGeolocalisation/tif:Zone/tif:Points/tif:DetailPoint/tif:Acces/tif:DetailAcces/tif:Nom",
    "minOccurs": 0,
    "maxOccurs": 1,
    "parent": 140
  },
  {
    "name": "@complement",
    "type": "attribute",
    "value": "forfait/jour",
    "xpath": "tif:Tarifs/tif:DetailTarifs/tif:DetailTarif/@complement",
    "minOccurs": 1,
    "maxOccurs": 1,
    "parent": 70
  },
  {
    "name": "tif:Description",
    "type": "element",
    "value": "Le domaine des Moulins de Roupeyac rassemble en un seul lieu les activités caractéristiques du Ségala : moulin à grain, moulin à huile de noix et scierie à scie battante en fonction. C\u0027est une maison d\u0027écrivain qui associe une demeure (le moulin), un auteur et son oeuvre. Ce site appartient non seulement à l\u0027histoire du Rouergue mais également au patrimoine littéraire national. Parcours littéraire (extérieur).",
    "xpath": "tif:DescriptionsComplementaires/tif:DetailDescriptionComplementaire/tif:Description",
    "minOccurs": 0,
    "maxOccurs": 3,
    "parent": 19
  },
  {
    "name": "tif:Dates",
    "type": "element",
    "xpath": "tif:Tarifs/tif:DetailTarifs/tif:DetailTarif/tif:DetailPeriode/tif:Dates",
    "minOccurs": 1,
    "maxOccurs": 1,
    "parent": 251
  },
  {
    "name": "@libelle",
    "type": "attribute",
    "value": "Ambassadeurs",
    "xpath": "tif:Classements/tif:DetailClassement/@libelle",
    "minOccurs": 1,
    "maxOccurs": 1,
    "parent": 208
  },
  {
    "name": "@type",
    "type": "attribute",
    "value": "13.05.01",
    "xpath": "tif:TarifsN1/tif:DetailTarifs/tif:DetailTarif/tif:MontantPourcent/@type",
    "minOccurs": 1,
    "maxOccurs": 1,
    "parent": 91
  },
  {
    "name": "tif:Superficie",
    "type": "element",
    "value": "0",
    "xpath": "tif:Capacites/tif:CapacitesPrestations/tif:DetailCapacitePrestation/tif:Superficie",
    "minOccurs": 0,
    "maxOccurs": 1,
    "parent": 21
  },
  {
    "name": "@type",
    "type": "attribute",
    "value": "04.02.01",
    "xpath": "tif:Contacts/tif:DetailContact/tif:Adresses/tif:DetailAdresse/tif:Personnes/tif:DetailPersonne/tif:MoyensCommunications/tif:DetailMoyenCom/@type",
    "minOccurs": 1,
    "maxOccurs": 1,
    "parent": 151
  },
  {
    "name": "tif:Update",
    "type": "element",
    "xpath": "tif:Update",
    "minOccurs": 1,
    "maxOccurs": 1
  },
  {
    "name": "tif:MoyensCommunications",
    "type": "element",
    "xpath": "tif:Contacts/tif:DetailContact/tif:DetailContact/tif:Adresses/tif:DetailAdresse/tif:Personnes/tif:DetailPersonne/tif:MoyensCommunications",
    "minOccurs": 1,
    "maxOccurs": 1,
    "empty": true,
    "parent": 324
  },
  {
    "name": "@libelle",
    "type": "attribute",
    "value": "Ouverture",
    "xpath": "tif:Periodes/tif:DetailPeriode/@libelle",
    "minOccurs": 1,
    "maxOccurs": 1,
    "parent": 164
  },
  {
    "name": "tif:DureePrest",
    "type": "element",
    "value": "0",
    "xpath": "tif:OffresPrestations/tif:DetailOffrePrestation/tif:DetailPrestation/tif:DureePrest",
    "minOccurs": 0,
    "maxOccurs": 1,
    "parent": 369
  },
  {
    "name": "tif:TarifRef",
    "type": "element",
    "value": "N",
    "xpath": "tif:TarifsN1/tif:DetailTarifs/tif:DetailTarif/tif:TarifRef",
    "minOccurs": 0,
    "maxOccurs": 1,
    "parent": 323
  },
  {
    "name": "@libelle",
    "type": "attribute",
    "value": "Point",
    "xpath": "tif:Geolocalisations/tif:DetailGeolocalisation/@libelle",
    "minOccurs": 1,
    "maxOccurs": 1,
    "parent": 240
  },
  {
    "name": "@id",
    "type": "attribute",
    "value": "id_prop_P00432",
    "xpath": "tif:Contacts/tif:DetailContact/@id",
    "minOccurs": 1,
    "maxOccurs": 1,
    "parent": 195
  },
  {
    "name": "sy:updateBase",
    "type": "element",
    "value": "2008-01-01",
    "xpath": "tif:Update/sy:updateBase",
    "minOccurs": 0,
    "maxOccurs": 1,
    "parent": 338
  },
  {
    "name": "@libelle",
    "type": "attribute",
    "value": "Moyen de communication",
    "xpath": "tif:Contacts/tif:DetailContact/tif:DetailContact/tif:Adresses/tif:DetailAdresse/tif:Personnes/tif:DetailPersonne/@libelle",
    "minOccurs": 1,
    "maxOccurs": 1,
    "parent": 324
  },
  {
    "name": "tif:TarifMax",
    "type": "element",
    "value": "15",
    "xpath": "tif:Tarifs/tif:DetailTarifs/tif:DetailTarif/tif:TarifMax",
    "minOccurs": 0,
    "maxOccurs": 1,
    "parent": 70
  },
  {
    "name": "@libelle",
    "type": "attribute",
    "value": "A midi",
    "xpath": "tif:Periodes/tif:DetailPeriode/tif:Dates/tif:DetailDates/tif:Jours/tif:DetailJours/tif:Jour/tif:Moments/tif:DetailMoments/tif:Moment/@libelle",
    "minOccurs": 1,
    "maxOccurs": 1,
    "parent": 197
  },
  {
    "name": "tif:DetailAdresse",
    "type": "element",
    "xpath": "tif:ModesReservations/tif:DetailModeReservation/tif:Contacts/tif:DetailContact/tif:Adresses/tif:DetailAdresse",
    "minOccurs": 1,
    "maxOccurs": 1,
    "parent": 275
  },
  {
    "name": "tif:Superficie",
    "type": "element",
    "value": "70",
    "xpath": "tif:Capacites/tif:CapacitesGlobales/tif:Superficie",
    "minOccurs": 0,
    "maxOccurs": 4,
    "parent": 122
  },
  {
    "name": "tif:ObservationDetailClassement",
    "type": "element",
    "value": "Pack performance",
    "xpath": "tif:Classements/tif:DetailClassement/tif:ObservationDetailClassement",
    "minOccurs": 0,
    "maxOccurs": 4,
    "parent": 208
  },
  {
    "name": "tif:Adresses",
    "type": "element",
    "xpath": "tif:Contacts/tif:DetailContact/tif:DetailContact/tif:Adresses",
    "minOccurs": 1,
    "maxOccurs": 1,
    "parent": 304
  },
  {
    "name": "tif:Capacite",
    "type": "element",
    "value": "30",
    "xpath": "tif:Capacites/tif:CapacitesGlobales/tif:Capacite",
    "minOccurs": 0,
    "maxOccurs": 9,
    "parent": 122
  },
  {
    "name": "@unite",
    "type": "attribute",
    "value": "unite",
    "xpath": "tif:OffresPrestations/tif:DetailOffrePrestation/tif:DetailPrestation/tif:NbPrest/@unite",
    "minOccurs": 1,
    "maxOccurs": 1,
    "parent": 247
  },
  {
    "name": "@classee",
    "type": "attribute",
    "value": "N",
    "xpath": "tif:Capacites/tif:CapacitesGlobales/tif:Capacite/@classee",
    "minOccurs": 1,
    "maxOccurs": 1,
    "parent": 353
  },
  {
    "name": "@libelle",
    "type": "attribute",
    "value": "Piscine collective",
    "xpath": "tif:OffresPrestations/tif:DetailOffrePrestation/tif:DetailPrestation/tif:Prestation/@libelle",
    "minOccurs": 1,
    "maxOccurs": 1,
    "parent": 143
  },
  {
    "name": "@libelle",
    "type": "attribute",
    "value": "A midi",
    "xpath": "tif:Periodes/tif:DetailPeriode/tif:Dates/tif:DetailDates/tif:Moments/tif:DetailMoments/tif:Moment/@libelle",
    "minOccurs": 1,
    "maxOccurs": 1,
    "parent": 76
  },
  {
    "name": "@unite",
    "type": "attribute",
    "value": "octets",
    "xpath": "tif:Multimedia/tif:DetailMultimedia/tif:TailleRessource/@unite",
    "minOccurs": 1,
    "maxOccurs": 1,
    "parent": 374
  },
  {
    "name": "tif:MontantPourcent",
    "type": "element",
    "value": "Montant",
    "xpath": "tif:Tarifs/tif:DetailTarifs/tif:DetailTarif/tif:MontantPourcent",
    "minOccurs": 0,
    "maxOccurs": 1,
    "parent": 70
  },
  {
    "name": "@type",
    "type": "attribute",
    "value": "14.01.02",
    "xpath": "tif:Capacites/tif:CapacitesGlobales/@type",
    "minOccurs": 1,
    "maxOccurs": 1,
    "parent": 122
  },
  {
    "name": "tif:Horaires",
    "type": "element",
    "xpath": "tif:Periodes/tif:DetailPeriode/tif:Dates/tif:DetailDates/tif:Jours/tif:DetailJours/tif:Jour/tif:Horaires",
    "minOccurs": 0,
    "maxOccurs": 1,
    "parent": 254
  },
  {
    "name": "@code",
    "type": "attribute",
    "value": "12092",
    "xpath": "tif:OffresPrestations/tif:DetailOffrePrestation/tif:DetailPrestation/tif:Commune/@code",
    "minOccurs": 1,
    "maxOccurs": 1,
    "parent": 321
  },
  {
    "name": "@type",
    "type": "attribute",
    "value": "04.01.03",
    "xpath": "tif:Contacts/tif:DetailContact/tif:DetailContact/tif:Adresses/tif:DetailAdresse/tif:Personnes/tif:DetailPersonne/tif:Civilite/@type",
    "minOccurs": 1,
    "maxOccurs": 1,
    "parent": 150
  },
  {
    "name": "@lib_jour",
    "type": "attribute",
    "value": "09.02.08",
    "xpath": "tif:Periodes/tif:DetailPeriode/tif:Dates/tif:DetailDates/tif:Jours/tif:DetailJours/tif:Jour/@lib_jour",
    "minOccurs": 1,
    "maxOccurs": 1,
    "parent": 254
  },
  {
    "name": "tif:Latitude",
    "type": "element",
    "value": "44.10728254916085",
    "xpath": "tif:Geolocalisations/tif:DetailGeolocalisation/tif:Zone/tif:Points/tif:DetailPoint/tif:Coordonnees/tif:DetailCoordonnees/tif:Latitude",
    "minOccurs": 1,
    "maxOccurs": 1,
    "parent": 75
  },
  {
    "name": "@type",
    "type": "attribute",
    "value": "08.02.05.11",
    "xpath": "tif:Geolocalisations/tif:DetailGeolocalisation/tif:Zone/tif:Points/tif:DetailPoint/@type",
    "minOccurs": 1,
    "maxOccurs": 1,
    "parent": 127
  },
  {
    "name": "@libelle",
    "type": "attribute",
    "value": "Géographiques (UTM compatible avec GPS)",
    "xpath": "tif:Geolocalisations/tif:DetailGeolocalisation/tif:Zone/tif:Points/tif:DetailPoint/tif:Coordonnees/tif:DetailCoordonnees/@libelle",
    "minOccurs": 1,
    "maxOccurs": 1,
    "parent": 75
  },
  {
    "name": "@type",
    "type": "attribute",
    "value": "07.01.04",
    "xpath": "tif:PrestationsLiees/tif:DetailPrestationLiee/@type",
    "minOccurs": 1,
    "maxOccurs": 1,
    "parent": 225
  },
  {
    "name": "tif:DetailPrestation",
    "type": "element",
    "xpath": "tif:OffresPrestations/tif:DetailOffrePrestation/tif:DetailPrestation",
    "minOccurs": 1,
    "maxOccurs": 55,
    "parent": 65
  },
  {
    "name": "tif:NbPersMax",
    "type": "element",
    "value": "0",
    "xpath": "tif:Clienteles/tif:DetailClienteles/tif:DetailClient/tif:NbPersMax",
    "minOccurs": 1,
    "maxOccurs": 1,
    "parent": 27
  },
  {
    "name": "@type",
    "type": "attribute",
    "value": "08.02.02.03",
    "xpath": "tif:Geolocalisations/tif:DetailGeolocalisation/tif:Zone/tif:Points/tif:DetailPoint/tif:Coordonnees/tif:DetailCoordonnees/@type",
    "minOccurs": 1,
    "maxOccurs": 1,
    "parent": 75
  },
  {
    "name": "tif:TarifsN1",
    "type": "element",
    "xpath": "tif:TarifsN1",
    "minOccurs": 1,
    "maxOccurs": 1
  },
  {
    "name": "tif:DetailHoraire",
    "type": "element",
    "xpath": "tif:Periodes/tif:DetailPeriode/tif:Dates/tif:DetailDates/tif:Jours/tif:DetailJours/tif:Jour/tif:Horaires/tif:DetailHoraire",
    "minOccurs": 0,
    "maxOccurs": 2,
    "parent": 361
  },
  {
    "name": "tif:TailleRessource",
    "type": "element",
    "value": "291991",
    "xpath": "tif:Multimedia/tif:DetailMultimedia/tif:TailleRessource",
    "minOccurs": 0,
    "maxOccurs": 1,
    "parent": 309
  },
  {
    "name": "tif:Periodes",
    "type": "element",
    "xpath": "tif:Periodes",
    "minOccurs": 1,
    "maxOccurs": 1
  },
  {
    "name": "@libelle",
    "type": "attribute",
    "value": "Fermé",
    "xpath": "tif:Contacts/tif:DetailContact/tif:Adresses/tif:DetailAdresse/tif:DetailGeolocalisation/tif:Zone/@libelle",
    "minOccurs": 1,
    "maxOccurs": 1,
    "parent": 23
  },
  {
    "name": "@type",
    "type": "attribute",
    "value": "13.04.01.39",
    "xpath": "tif:Tarifs/tif:DetailTarifs/tif:DetailTarif/@type",
    "minOccurs": 1,
    "maxOccurs": 1,
    "parent": 70
  },
  {
    "name": "tif:SurfaceMoyenne",
    "type": "element",
    "value": "130",
    "xpath": "tif:Capacites/tif:CapacitesUnites/tif:DetailCapaciteUnite/tif:Dispositions/tif:DetailDisposition/tif:SurfaceMoyenne",
    "minOccurs": 0,
    "maxOccurs": 1,
    "parent": 3
  },
  {
    "name": "@xml:lang",
    "type": "attribute",
    "value": "FR",
    "xpath": "tif:Geolocalisations/tif:DetailGeolocalisation/@xml:lang",
    "minOccurs": 1,
    "maxOccurs": 1,
    "parent": 240
  },
  {
    "name": "@id",
    "type": "attribute",
    "value": "TS_2010",
    "xpath": "tif:Tarifs/tif:DetailTarifs/tif:DetailTarif/tif:DetailPeriode/@id",
    "minOccurs": 1,
    "maxOccurs": 1,
    "parent": 251
  },
  {
    "name": "tif:Nom",
    "type": "element",
    "value": "Musée François Fabié - Durenque",
    "xpath": "tif:Geolocalisations/tif:DetailGeolocalisation/tif:Zone/tif:Points/tif:DetailPoint/tif:Nom",
    "minOccurs": 0,
    "maxOccurs": 1,
    "parent": 127
  },
  {
    "name": "@libelle",
    "type": "attribute",
    "value": "Fermé",
    "xpath": "tif:Geolocalisations/tif:DetailGeolocalisation/tif:Zone/@libelle",
    "minOccurs": 1,
    "maxOccurs": 1,
    "parent": 220
  },
  {
    "name": "@unite",
    "type": "attribute",
    "value": "01.03.02.01",
    "xpath": "tif:Geolocalisations/tif:DetailGeolocalisation/tif:Zone/tif:Points/tif:DetailPoint/tif:Acces/tif:DetailAcces/tif:Distance/@unite",
    "minOccurs": 1,
    "maxOccurs": 1,
    "parent": 215
  },
  {
    "name": "tif:DateClassement",
    "type": "element",
    "value": "2016-10-06",
    "xpath": "tif:Classements/tif:DetailClassement/tif:DateClassement",
    "minOccurs": 0,
    "maxOccurs": 1,
    "parent": 208
  },
  {
    "name": "tif:Largeur",
    "type": "element",
    "value": "600",
    "xpath": "tif:Multimedia/tif:DetailMultimedia/tif:Largeur",
    "minOccurs": 0,
    "maxOccurs": 1,
    "parent": 309
  },
  {
    "name": "tif:DateDebut",
    "type": "element",
    "value": "2010-01-01",
    "xpath": "tif:Tarifs/tif:DetailTarifs/tif:DetailTarif/tif:DetailPeriode/tif:Dates/tif:DetailDates/tif:DateDebut",
    "minOccurs": 1,
    "maxOccurs": 1,
    "parent": 114
  },
  {
    "name": "tif:DescriptionTarif",
    "type": "element",
    "value": "chambre repas (partenariat avec la cafétéria en face l\u0027hôtel et le Glacier) et petit-déjeuner",
    "xpath": "tif:TarifsN1/tif:DetailTarifs/tif:DetailTarif/tif:DescriptionTarif",
    "minOccurs": 0,
    "maxOccurs": 1,
    "parent": 323
  },
  {
    "name": "@id",
    "type": "attribute",
    "value": "1",
    "xpath": "tif:Periodes/tif:DetailPeriode/@id",
    "minOccurs": 1,
    "maxOccurs": 1,
    "parent": 164
  },
  {
    "name": "@libelle",
    "type": "attribute",
    "value": "Ouverture",
    "xpath": "tif:Periodes/tif:DetailPeriode/tif:Dates/tif:DetailDates/tif:Jours/tif:DetailJours/@libelle",
    "minOccurs": 1,
    "maxOccurs": 1,
    "parent": 31
  }
]