{
  "@context": {
    "": "https://www.datatourisme.gouv.fr/resource/core#",
    "schema": "http://schema.org/",
    "data": "https://www.datatourisme.gouv.fr/data/",
    "owl": "http://www.w3.org/2002/07/owl#",
    "xsd": "http://www.w3.org/2001/XMLSchema#",
    "rdfs": "http://www.w3.org/2000/01/rdf-schema#",
    "ns0": "https://www.datatourisme.gouv.fr/ontology/core#",
    "ns2": "http://www.w3.org/2004/02/skos/core#",
    "olo": "http://purl.org/ontology/olo/core#",
    "dct": "http://purl.org/dc/terms/",
    "rdf": "http://www.w3.org/1999/02/22-rdf-syntax-ns#",
    "xml": "http://www.w3.org/XML/1998/namespace",
    "spin": "http://spinrdf.org/spin#",
    "ebucore": "http://www.ebu.ch/metadata/ontologies/ebucore/ebucore#",
    "sp": "http://spinrdf.org/sp#",
    "foaf": "http://xmlns.com/foaf/0.1/",
    "dc": "http://purl.org/dc/elements/1.1/"
  },
  "resource": {
    "uri": "data:null/b2f21f1d-336e-3fb7-bb9b-55fdd1f322bc",
    "types": [
      "ns0:PointOfInterest"
    ],
    "label": "Maison de Pays de La Chapelle de Guinchay",
    "properties": [
      {
        "uri": "ns0:hasPart",
        "label": "a pour partie",
        "mapped": false
      },
      {
        "uri": "ns0:isAPartOf",
        "label": "est une partie de",
        "mapped": false
      },
      {
        "uri": "ns0:isOwnedBy",
        "label": "appartient à",
        "mapped": false
      },
      {
        "uri": "ns0:suggests",
        "label": "recommande",
        "mapped": false
      },
      {
        "uri": "ns0:hasBeenCreatedBy",
        "label": "a été créé par",
        "mapped": false
      },
      {
        "uri": "ns0:hasContact",
        "label": "a pour contact",
        "mapped": false
      },
      {
        "uri": "ns0:hasFeature",
        "label": "propose comme équipement",
        "mapped": false
      },
      {
        "uri": "ns0:hasDescription",
        "label": "a pour description",
        "mapped": false
      },
      {
        "uri": "ns0:hasTheme",
        "label": "a pour thème",
        "mapped": false
      },
      {
        "uri": "ns0:hasBeenPublishedBy",
        "label": "a été publié par",
        "values": [
          {
            "uri": "data:c068b9db-237b-3e39-8541-281bb0dc232d",
            "types": [
              "foaf:Organization",
              "ns0:Organisation",
              "ns0:Agent",
              "foaf:Agent",
              "schema:Organization"
            ],
            "properties": [
              {
                "uri": "ns0:rcs",
                "label": "Code RCS",
                "mapped": false
              },
              {
                "uri": "ns0:agreementLicense",
                "label": "Numéro d'agrément",
                "values": [
                  "Maison de Pays de La Chapelle de Guinchay"
                ],
                "mapped": true
              },
              {
                "uri": "ns0:hasPublished",
                "label": "a publié",
                "mapped": false
              },
              {
                "uri": "ns0:siret",
                "label": "Siret",
                "mapped": false
              },
              {
                "uri": "ns0:apeNaf",
                "label": "Code APE (Naf)",
                "mapped": false
              },
              {
                "uri": "schema:logo",
                "label": "Logo",
                "mapped": false
              },
              {
                "uri": "ns0:hasCreated",
                "label": "a créé",
                "mapped": false
              },
              {
                "uri": "schema:telephone",
                "label": "Téléphone",
                "mapped": false
              },
              {
                "uri": "rdfs:comment",
                "label": "Description",
                "mapped": false
              },
              {
                "uri": "schema:email",
                "label": "Courriel",
                "mapped": false
              },
              {
                "uri": "foaf:nick",
                "label": "Sigle ou pseudo",
                "mapped": false
              },
              {
                "uri": "schema:faxNumber",
                "label": "Fax",
                "mapped": false
              },
              {
                "uri": "foaf:homepage",
                "label": "Site internet",
                "mapped": false
              },
              {
                "uri": "rdf:type",
                "values": [
                  {
                    "uri": "schema:Organization"
                  },
                  {
                    "uri": "ns0:Agent"
                  },
                  {
                    "uri": "foaf:Agent"
                  },
                  {
                    "uri": "ns0:Organisation"
                  },
                  {
                    "uri": "foaf:Organization"
                  }
                ],
                "mapped": false
              },
              {
                "uri": "ns0:owns",
                "label": "possède",
                "mapped": false
              }
            ]
          }
        ],
        "mapped": true
      },
      {
        "uri": "ns0:hasRepresentation",
        "label": "a pour représentation",
        "mapped": false
      },
      {
        "uri": "ns0:hasReview",
        "label": "est classé",
        "mapped": false
      },
      {
        "uri": "dc:identifier",
        "values": [
          "69PBEQU100166"
        ],
        "mapped": false
      },
      {
        "uri": "ns0:isEquippedWith",
        "label": "est équipé de",
        "mapped": false
      },
      {
        "uri": "ns0:isLocatedAt",
        "label": "est localisé à",
        "mapped": false
      },
      {
        "uri": "rdfs:comment",
        "label": "Description",
        "mapped": false
      },
      {
        "uri": "ns0:availableLanguage",
        "label": "Langue disponible",
        "mapped": false
      },
      {
        "uri": "ns0:hasMainRepresentation",
        "label": "a pour représentation principale",
        "mapped": false
      },
      {
        "uri": "ns0:creationDate",
        "label": "Date de création",
        "mapped": false
      },
      {
        "uri": "rdfs:label",
        "label": "Nom court",
        "values": [
          "Maison de Pays de La Chapelle de Guinchay"
        ],
        "mapped": true
      },
      {
        "uri": "ns0:reducedMobilityAccess",
        "label": "Accès pour personnes à mobilité réduite",
        "values": [
          "false"
        ],
        "mapped": true
      },
      {
        "uri": "ns0:lastUpdate",
        "label": "Date de dernière mise à jour",
        "mapped": false
      },
      {
        "uri": "rdf:type",
        "values": [
          {
            "uri": "ns0:PointOfInterest"
          }
        ],
        "anomalies": [
          {
            "error": true,
            "message": "\"Le POI n'a pas de type spécifique\""
          }
        ],
        "mapped": false
      },
      {
        "uri": "ns0:isReferencedBy",
        "label": "est référencé par",
        "mapped": false
      }
    ]
  },
  "report": {
    "valid": false,
    "reports": [
      {
        "message": "\"Le POI n'a pas de type spécifique\"",
        "subject": "https://www.datatourisme.gouv.fr/data/null/b2f21f1d-336e-3fb7-bb9b-55fdd1f322bc",
        "target": "http://www.w3.org/1999/02/22-rdf-syntax-ns#type",
        "error": true
      }
    ]
  }
}