{
  "https://www.datatourisme.gouv.fr/ontology/core#CulturalSite": 13,
  "https://www.datatourisme.gouv.fr/ontology/core#FoodEstablishment": 9,
  "https://www.datatourisme.gouv.fr/ontology/core#EntertainmentAndEvent": 9,
  "https://www.datatourisme.gouv.fr/ontology/core#NaturalHeritage": 4,
  "https://www.datatourisme.gouv.fr/ontology/core#Place": 28,
  "https://www.datatourisme.gouv.fr/ontology/core#PlaceOfInterest": 28,
  "https://www.datatourisme.gouv.fr/ontology/core#PointOfInterest": 50,
  "https://www.datatourisme.gouv.fr/ontology/core#Restaurant": 9,
  "https://www.datatourisme.gouv.fr/ontology/core#Tour": 1
}