{
  "openapi": "3.0.1",
  "info": {
    "title": "iparapheur",
    "description": "iparapheur v5.x main core application.\n\nThe main link between every sub-services, integrating business code logic.\n",
    "contact": {
      "name": "Libriciel SCOP",
      "url": "https://libriciel.fr",
      "email": "iparapheur@libriciel.coop"
    },
    "license": {
      "name": "Affero GPL 3.0",
      "url": "https://www.gnu.org/licenses/agpl-3.0.en.html"
    },
    "version": "DEVELOP"
  },
  "externalDocs": {
    "url": "https://www.libriciel.fr/i-parapheur/"
  },
  "servers": [
    {
      "url": "http://localhost:8080",
      "description": "Generated server url"
    }
  ],
  "security": [
    {
      "spring_oauth": []
    }
  ],
  "tags": [
    {
      "name": "workflow",
      "description": "Workflow access for a regular logged user"
    },
    {
      "name": "admin-trash-bin",
      "description": "Reserved operations on trash-bin"
    },
    {
      "name": "tenant",
      "description": "Tenant access for a regular logged user"
    },
    {
      "name": "folder",
      "description": "Folder access for a regular logged user"
    }
  ],
  "paths": {
    "/api/standard/v1/tenant/{tenantId}/desk/{deskId}/folder/{folderId}/task/{taskId}/undo": {
      "put": {
        "tags": [
          "workflow"
        ],
        "summary": "Undo",
        "description": "Rollback the action to the previous state.",
        "operationId": "undo",
        "parameters": [
          {
            "name": "tenantId",
            "in": "path",
            "description": "Tenant id",
            "required": true,
            "schema": {
              "type": "string"
            }
          },
          {
            "name": "deskId",
            "in": "path",
            "description": "Desk id",
            "required": true,
            "schema": {
              "type": "string"
            }
          },
          {
            "name": "folderId",
            "in": "path",
            "description": "Folder id",
            "required": true,
            "schema": {
              "type": "string"
            }
          },
          {
            "name": "taskId",
            "in": "path",
            "description": "Task id",
            "required": true,
            "schema": {
              "type": "string"
            }
          }
        ],
        "responses": {
          "403": {
            "description": "Forbidden",
            "content": {
              "application/json": {
                "schema": {
                  "$ref": "#/components/schemas/ErrorResponse"
                }
              }
            }
          },
          "200": {
            "description": "OK"
          },
          "404": {
            "description": "Not Found",
            "content": {
              "application/json": {
                "schema": {
                  "$ref": "#/components/schemas/ErrorResponse"
                }
              }
            }
          },
          "401": {
            "description": "Unauthorized",
            "content": {
              "application/json": {
                "schema": {
                  "$ref": "#/components/schemas/ErrorResponse"
                }
              }
            }
          },
          "400": {
            "description": "Bad Request",
            "content": {
              "application/json": {
                "schema": {
                  "$ref": "#/components/schemas/ErrorResponse"
                }
              }
            }
          }
        }
      }
    },
    "/api/standard/v1/tenant/{tenantId}/desk/{deskId}/folder/{folderId}/task/{taskId}/start": {
      "put": {
        "tags": [
          "workflow"
        ],
        "summary": "Start",
        "description": "Start the given Folder",
        "operationId": "start",
        "parameters": [
          {
            "name": "tenantId",
            "in": "path",
            "description": "Tenant id",
            "required": true,
            "schema": {
              "type": "string"
            }
          },
          {
            "name": "deskId",
            "in": "path",
            "description": "Desk id",
            "required": true,
            "schema": {
              "type": "string"
            }
          },
          {
            "name": "folderId",
            "in": "path",
            "description": "Folder id",
            "required": true,
            "schema": {
              "type": "string"
            }
          },
          {
            "name": "taskId",
            "in": "path",
            "required": true,
            "schema": {
              "type": "string"
            }
          }
        ],
        "requestBody": {
          "content": {
            "application/json": {
              "schema": {
                "$ref": "#/components/schemas/SimpleTaskParams"
              }
            }
          },
          "required": true
        },
        "responses": {
          "403": {
            "description": "Forbidden",
            "content": {
              "application/json": {
                "schema": {
                  "$ref": "#/components/schemas/ErrorResponse"
                }
              }
            }
          },
          "200": {
            "description": "OK"
          },
          "404": {
            "description": "Not Found",
            "content": {
              "application/json": {
                "schema": {
                  "$ref": "#/components/schemas/ErrorResponse"
                }
              }
            }
          },
          "401": {
            "description": "Unauthorized",
            "content": {
              "application/json": {
                "schema": {
                  "$ref": "#/components/schemas/ErrorResponse"
                }
              }
            }
          },
          "407": {
            "description": "Proxy Authentication Required",
            "content": {
              "application/json": {
                "schema": {
                  "$ref": "#/components/schemas/ErrorResponse"
                }
              }
            }
          }
        }
      }
    },
    "/api/standard/v1/tenant/{tenantId}/desk/{deskId}/folder/{folderId}/task/{taskId}/send_to_trash_bin": {
      "put": {
        "tags": [
          "workflow"
        ],
        "summary": "Send to trash-bin",
        "description": "Only applicable to ended folders, this will remove the folder content into the trash-bin, where it will soon be auto-erased.",
        "operationId": "sendToTrashBin",
        "parameters": [
          {
            "name": "tenantId",
            "in": "path",
            "description": "Tenant id",
            "required": true,
            "schema": {
              "type": "string"
            }
          },
          {
            "name": "deskId",
            "in": "path",
            "description": "Desk id",
            "required": true,
            "schema": {
              "type": "string"
            }
          },
          {
            "name": "folderId",
            "in": "path",
            "description": "Folder id",
            "required": true,
            "schema": {
              "type": "string"
            }
          },
          {
            "name": "taskId",
            "in": "path",
            "required": true,
            "schema": {
              "type": "string"
            }
          }
        ],
        "responses": {
          "403": {
            "description": "Forbidden",
            "content": {
              "application/json": {
                "schema": {
                  "$ref": "#/components/schemas/ErrorResponse"
                }
              }
            }
          },
          "409": {
            "description": "Conflict",
            "content": {
              "application/json": {
                "schema": {
                  "$ref": "#/components/schemas/ErrorResponse"
                }
              }
            }
          },
          "200": {
            "description": "OK"
          },
          "404": {
            "description": "Not Found",
            "content": {
              "application/json": {
                "schema": {
                  "$ref": "#/components/schemas/ErrorResponse"
                }
              }
            }
          },
          "401": {
            "description": "Unauthorized",
            "content": {
              "application/json": {
                "schema": {
                  "$ref": "#/components/schemas/ErrorResponse"
                }
              }
            }
          }
        }
      }
    },
    "/api/standard/v1/tenant/{tenantId}/desk/{deskId}/folder/{folderId}/task/{taskId}/secure_mail": {
      "put": {
        "tags": [
          "workflow"
        ],
        "summary": "Secure mail",
        "description": "Send a secure mail",
        "operationId": "requestSecureMail",
        "parameters": [
          {
            "name": "tenantId",
            "in": "path",
            "description": "Tenant id",
            "required": true,
            "schema": {
              "type": "string"
            }
          },
          {
            "name": "deskId",
            "in": "path",
            "description": "Desk id",
            "required": true,
            "schema": {
              "type": "string"
            }
          },
          {
            "name": "folderId",
            "in": "path",
            "description": "Folder id",
            "required": true,
            "schema": {
              "type": "string"
            }
          },
          {
            "name": "taskId",
            "in": "path",
            "description": "Task id",
            "required": true,
            "schema": {
              "type": "string"
            }
          }
        ],
        "requestBody": {
          "content": {
            "application/json": {
              "schema": {
                "$ref": "#/components/schemas/MailParams"
              }
            }
          },
          "required": true
        },
        "responses": {
          "403": {
            "description": "Forbidden",
            "content": {
              "application/json": {
                "schema": {
                  "$ref": "#/components/schemas/ErrorResponse"
                }
              }
            }
          },
          "200": {
            "description": "OK"
          },
          "404": {
            "description": "Not Found",
            "content": {
              "application/json": {
                "schema": {
                  "$ref": "#/components/schemas/ErrorResponse"
                }
              }
            }
          },
          "401": {
            "description": "Unauthorized",
            "content": {
              "application/json": {
                "schema": {
                  "$ref": "#/components/schemas/ErrorResponse"
                }
              }
            }
          },
          "400": {
            "description": "Bad Request",
            "content": {
              "application/json": {
                "schema": {
                  "$ref": "#/components/schemas/ErrorResponse"
                }
              }
            }
          }
        }
      }
    },
    "/api/standard/v1/tenant/{tenantId}/desk/{deskId}/folder/{folderId}/task/{taskId}/bypass": {
      "put": {
        "tags": [
          "workflow"
        ],
        "summary": "Bypass",
        "description": "Force an external task stuck in a waiting state.",
        "operationId": "bypass",
        "parameters": [
          {
            "name": "tenantId",
            "in": "path",
            "description": "Tenant id",
            "required": true,
            "schema": {
              "type": "string"
            }
          },
          {
            "name": "deskId",
            "in": "path",
            "description": "Desk id",
            "required": true,
            "schema": {
              "type": "string"
            }
          },
          {
            "name": "folderId",
            "in": "path",
            "description": "Folder id",
            "required": true,
            "schema": {
              "type": "string"
            }
          },
          {
            "name": "taskId",
            "in": "path",
            "description": "Task id",
            "required": true,
            "schema": {
              "type": "string"
            }
          }
        ],
        "responses": {
          "403": {
            "description": "Forbidden",
            "content": {
              "application/json": {
                "schema": {
                  "$ref": "#/components/schemas/ErrorResponse"
                }
              }
            }
          },
          "200": {
            "description": "OK"
          },
          "404": {
            "description": "Not Found",
            "content": {
              "application/json": {
                "schema": {
                  "$ref": "#/components/schemas/ErrorResponse"
                }
              }
            }
          },
          "401": {
            "description": "Unauthorized",
            "content": {
              "application/json": {
                "schema": {
                  "$ref": "#/components/schemas/ErrorResponse"
                }
              }
            }
          },
          "400": {
            "description": "Bad Request",
            "content": {
              "application/json": {
                "schema": {
                  "$ref": "#/components/schemas/ErrorResponse"
                }
              }
            }
          }
        }
      }
    },
    "/api/standard/v1/tenant": {
      "get": {
        "tags": [
          "tenant"
        ],
        "summary": "List tenants associated with the current user",
        "description": "Sorting properties are restricted to the TenantSortBy enum values",
        "operationId": "listTenants",
        "parameters": [
          {
            "name": "page",
            "in": "query",
            "description": "Zero-based page index (0..N)",
            "required": false,
            "schema": {
              "minimum": 0,
              "type": "integer",
              "default": 0
            }
          },
          {
            "name": "size",
            "in": "query",
            "description": "The size of the page to be returned",
            "required": false,
            "schema": {
              "minimum": 1,
              "type": "integer",
              "default": 10
            }
          },
          {
            "name": "sort",
            "in": "query",
            "description": "Sorting criteria in the format: property,(asc|desc). Default sort order is ascending. Multiple sort criteria are supported.",
            "required": false,
            "schema": {
              "type": "array",
              "items": {
                "type": "string"
              },
              "default": [
                "NAME,ASC"
              ]
            }
          }
        ],
        "responses": {
          "403": {
            "description": "Forbidden",
            "content": {
              "application/json": {
                "schema": {
                  "$ref": "#/components/schemas/ErrorResponse"
                }
              }
            }
          },
          "200": {
            "description": "OK",
            "content": {
              "application/json": {
                "schema": {
                  "$ref": "#/components/schemas/PageTenantRepresentation"
                }
              }
            }
          },
          "401": {
            "description": "Unauthorized",
            "content": {
              "application/json": {
                "schema": {
                  "$ref": "#/components/schemas/ErrorResponse"
                }
              }
            }
          },
          "400": {
            "description": "Bad Request",
            "content": {
              "application/json": {
                "schema": {
                  "$ref": "#/components/schemas/ErrorResponse"
                }
              }
            }
          }
        }
      }
    },
    "/api/standard/v1/tenant/{tenantId}/desk/{deskId}/{state}": {
      "get": {
        "tags": [
          "folder"
        ],
        "summary": "List folders in the given state",
        "description": "Returns every folders of the given state, on the the given desk.\n\n- DRAFT (yellow pill)     : Non-started folders\n- PENDING (blue pill)     : Every pending folders on current desk\n- LATE (red pill)         : Same as PENDING, but only late ones\n- DELEGATED (purple pill) : Every pending folders that can be acted upon by delegation\n- FINISHED (green pill)   : Every finished workflow, ready to export\n- REJECTED (black pill)   : Every rejected workflow, ready to delete\n- RETRIEVABLE             : Available UNDO to perform\n",
        "operationId": "listFolders",
        "parameters": [
          {
            "name": "tenantId",
            "in": "path",
            "description": "Tenant id",
            "required": true,
            "schema": {
              "type": "string"
            }
          },
          {
            "name": "deskId",
            "in": "path",
            "description": "Desk id",
            "required": true,
            "schema": {
              "type": "string"
            }
          },
          {
            "name": "state",
            "in": "path",
            "required": true,
            "schema": {
              "$ref": "#/components/schemas/State"
            }
          },
          {
            "name": "typeId",
            "in": "query",
            "description": "Type id",
            "required": false,
            "schema": {
              "type": "string"
            }
          },
          {
            "name": "subtypeId",
            "in": "query",
            "description": "Subtype id",
            "required": false,
            "schema": {
              "type": "string"
            }
          },
          {
            "name": "page",
            "in": "query",
            "description": "Zero-based page index (0..N)",
            "required": false,
            "schema": {
              "minimum": 0,
              "type": "integer",
              "default": 0
            }
          },
          {
            "name": "size",
            "in": "query",
            "description": "The size of the page to be returned",
            "required": false,
            "schema": {
              "minimum": 1,
              "type": "integer",
              "default": 10
            }
          },
          {
            "name": "sort",
            "in": "query",
            "description": "Sorting criteria in the format: property,(asc|desc). Default sort order is ascending. Multiple sort criteria are supported.",
            "required": false,
            "schema": {
              "type": "array",
              "items": {
                "type": "string"
              },
              "default": [
                "CREATION_DATE,ASC"
              ]
            }
          }
        ],
        "responses": {
          "403": {
            "description": "Forbidden",
            "content": {
              "application/json": {
                "schema": {
                  "$ref": "#/components/schemas/ErrorResponse"
                }
              }
            }
          },
          "200": {
            "description": "OK",
            "content": {
              "application/json": {
                "schema": {
                  "$ref": "#/components/schemas/PageFolderRepresentation"
                }
              }
            }
          },
          "404": {
            "description": "Not Found",
            "content": {
              "application/json": {
                "schema": {
                  "$ref": "#/components/schemas/ErrorResponse"
                }
              }
            }
          },
          "401": {
            "description": "Unauthorized",
            "content": {
              "application/json": {
                "schema": {
                  "$ref": "#/components/schemas/ErrorResponse"
                }
              }
            }
          }
        }
      }
    },
    "/api/standard/v1/tenant/{tenantId}/desk/{deskId}/folder/{folderId}/zip": {
      "get": {
        "tags": [
          "folder"
        ],
        "summary": "Get every file as ZIP, with a PREMIS-formatted summary",
        "operationId": "downloadFolderZip",
        "parameters": [
          {
            "name": "tenantId",
            "in": "path",
            "description": "Tenant id",
            "required": true,
            "schema": {
              "type": "string"
            }
          },
          {
            "name": "deskId",
            "in": "path",
            "description": "Desk id",
            "required": true,
            "schema": {
              "type": "string"
            }
          },
          {
            "name": "folderId",
            "in": "path",
            "description": "Folder id",
            "required": true,
            "schema": {
              "type": "string"
            }
          }
        ],
        "responses": {
          "403": {
            "description": "Forbidden",
            "content": {
              "application/json": {
                "schema": {
                  "$ref": "#/components/schemas/ErrorResponse"
                }
              }
            }
          },
          "404": {
            "description": "Not Found",
            "content": {
              "application/json": {
                "schema": {
                  "$ref": "#/components/schemas/ErrorResponse"
                }
              }
            }
          },
          "401": {
            "description": "Unauthorized",
            "content": {
              "application/json": {
                "schema": {
                  "$ref": "#/components/schemas/ErrorResponse"
                }
              }
            }
          },
          "200": {
            "description": "OK",
            "content": {
              "application/octet-stream": {}
            }
          }
        }
      }
    },
    "/api/standard/v1/tenant/{tenantId}/desk/{deskId}/folder/{folderId}/premis": {
      "get": {
        "tags": [
          "folder"
        ],
        "summary": "Get a PREMIS-formatted file, containing the folder summary",
        "operationId": "downloadFolderPremis",
        "parameters": [
          {
            "name": "tenantId",
            "in": "path",
            "description": "Tenant id",
            "required": true,
            "schema": {
              "type": "string"
            }
          },
          {
            "name": "deskId",
            "in": "path",
            "description": "Desk id",
            "required": true,
            "schema": {
              "type": "string"
            }
          },
          {
            "name": "folderId",
            "in": "path",
            "description": "Folder id",
            "required": true,
            "schema": {
              "type": "string"
            }
          }
        ],
        "responses": {
          "403": {
            "description": "Forbidden",
            "content": {
              "application/json": {
                "schema": {
                  "$ref": "#/components/schemas/ErrorResponse"
                }
              }
            }
          },
          "200": {
            "description": "OK",
            "content": {
              "application/xml": {}
            }
          },
          "404": {
            "description": "Not Found",
            "content": {
              "application/json": {
                "schema": {
                  "$ref": "#/components/schemas/ErrorResponse"
                }
              }
            }
          },
          "401": {
            "description": "Unauthorized",
            "content": {
              "application/json": {
                "schema": {
                  "$ref": "#/components/schemas/ErrorResponse"
                }
              }
            }
          }
        }
      }
    },
    "/api/standard/v1/admin/tenant/{tenantId}/trash-bin": {
      "get": {
        "tags": [
          "admin-trash-bin"
        ],
        "summary": "List deleted folders.",
        "description": "Sorting properties are restricted to the FolderSortBy enum values\n\nThe trash-bin is deleting automatically its data after a few days.  \nUsing it is as a transit is not recommended, as **any delay in a folder process will result in a permanent loss of data**.\n\nThis endpoint requires an admin role.  \nUsing it is as a transit is not recommended, as **sharing an admin login information to a third-party software is a security risk.**\n",
        "operationId": "listTrashBinFolders",
        "parameters": [
          {
            "name": "tenantId",
            "in": "path",
            "description": "Tenant id",
            "required": true,
            "schema": {
              "type": "string"
            }
          },
          {
            "name": "page",
            "in": "query",
            "description": "Zero-based page index (0..N)",
            "required": false,
            "schema": {
              "minimum": 0,
              "type": "integer",
              "default": 0
            }
          },
          {
            "name": "size",
            "in": "query",
            "description": "The size of the page to be returned",
            "required": false,
            "schema": {
              "minimum": 1,
              "type": "integer",
              "default": 10
            }
          },
          {
            "name": "sort",
            "in": "query",
            "description": "Sorting criteria in the format: property,(asc|desc). Default sort order is ascending. Multiple sort criteria are supported.",
            "required": false,
            "schema": {
              "type": "array",
              "items": {
                "type": "string"
              },
              "default": [
                "FOLDER_NAME,ASC"
              ]
            }
          }
        ],
        "responses": {
          "403": {
            "description": "Forbidden",
            "content": {
              "application/json": {
                "schema": {
                  "$ref": "#/components/schemas/ErrorResponse"
                }
              }
            }
          },
          "200": {
            "description": "OK",
            "content": {
              "application/json": {
                "schema": {
                  "$ref": "#/components/schemas/PageFolderRepresentation"
                }
              }
            }
          },
          "404": {
            "description": "Not Found",
            "content": {
              "application/json": {
                "schema": {
                  "$ref": "#/components/schemas/ErrorResponse"
                }
              }
            }
          },
          "401": {
            "description": "Unauthorized",
            "content": {
              "application/json": {
                "schema": {
                  "$ref": "#/components/schemas/ErrorResponse"
                }
              }
            }
          }
        },
        "deprecated": true
      }
    },
    "/api/standard/v1/admin/tenant/{tenantId}/trash-bin/{folderId}/zip": {
      "get": {
        "tags": [
          "admin-trash-bin"
        ],
        "summary": "Download a folder as ZIP",
        "description": "Get every file, annexes and main document in a ZIP, with a PREMIS-formatted summary\n\nThe trash-bin is deleting automatically its data after a few days.  \nUsing it is as a transit is not recommended, as **any delay in a folder process will result in a permanent loss of data**.\n\nThis endpoint requires an admin role.  \nUsing it is as a transit is not recommended, as **sharing an admin login information to a third-party software is a security risk.**\n",
        "operationId": "downloadTrashBinFolderZip",
        "parameters": [
          {
            "name": "tenantId",
            "in": "path",
            "description": "Tenant id",
            "required": true,
            "schema": {
              "type": "string"
            }
          },
          {
            "name": "folderId",
            "in": "path",
            "description": "Folder id",
            "required": true,
            "schema": {
              "type": "string"
            }
          }
        ],
        "responses": {
          "403": {
            "description": "Forbidden",
            "content": {
              "application/json": {
                "schema": {
                  "$ref": "#/components/schemas/ErrorResponse"
                }
              }
            }
          },
          "404": {
            "description": "Not Found",
            "content": {
              "application/json": {
                "schema": {
                  "$ref": "#/components/schemas/ErrorResponse"
                }
              }
            }
          },
          "401": {
            "description": "Unauthorized",
            "content": {
              "application/json": {
                "schema": {
                  "$ref": "#/components/schemas/ErrorResponse"
                }
              }
            }
          },
          "200": {
            "description": "OK",
            "content": {
              "application/octet-stream": {}
            }
          }
        },
        "deprecated": true
      }
    },
    "/api/standard/v1/tenant/{tenantId}/desk/{deskId}/folder/{folderId}": {
      "delete": {
        "tags": [
          "folder"
        ],
        "summary": "Delete folder",
        "description": "Deletes the given folder.\nNote that current pending folders cannot be deleted here. Only drafts/rejected/finished ones.\nTo delete a currently pending folder, you need to go through the admin\u0027s access point.\n",
        "operationId": "deleteFolder",
        "parameters": [
          {
            "name": "tenantId",
            "in": "path",
            "description": "Tenant id",
            "required": true,
            "schema": {
              "type": "string"
            }
          },
          {
            "name": "deskId",
            "in": "path",
            "description": "Desk id",
            "required": true,
            "schema": {
              "type": "string"
            }
          },
          {
            "name": "folderId",
            "in": "path",
            "description": "Folder id",
            "required": true,
            "schema": {
              "type": "string"
            }
          }
        ],
        "responses": {
          "204": {
            "description": "No Content"
          },
          "403": {
            "description": "Forbidden",
            "content": {
              "application/json": {
                "schema": {
                  "$ref": "#/components/schemas/ErrorResponse"
                }
              }
            }
          },
          "404": {
            "description": "Not Found",
            "content": {
              "application/json": {
                "schema": {
                  "$ref": "#/components/schemas/ErrorResponse"
                }
              }
            }
          },
          "401": {
            "description": "Unauthorized",
            "content": {
              "application/json": {
                "schema": {
                  "$ref": "#/components/schemas/ErrorResponse"
                }
              }
            }
          },
          "406": {
            "description": "Not Acceptable",
            "content": {
              "application/json": {
                "schema": {
                  "$ref": "#/components/schemas/ErrorResponse"
                }
              }
            }
          }
        }
      }
    }
  },
  "components": {
    "schemas": {
      "ErrorResponse": {
        "type": "object",
        "properties": {
          "timestamp": {
            "type": "string"
          },
          "status": {
            "type": "integer",
            "format": "int32"
          },
          "error": {
            "type": "string"
          },
          "message": {
            "type": "string"
          },
          "path": {
            "type": "string"
          }
        }
      },
      "FolderRepresentation": {
        "required": [
          "name"
        ],
        "type": "object",
        "properties": {
          "id": {
            "type": "string",
            "readOnly": true
          },
          "name": {
            "maxLength": 255,
            "minLength": 2,
            "pattern": "^[^\\r\\n\b ]*$",
            "type": "string"
          },
          "dueDate": {
            "type": "string",
            "format": "date-time",
            "nullable": true
          },
          "metadata": {
            "type": "object",
            "additionalProperties": {
              "type": "string"
            }
          }
        }
      },
      "FolderSortBy": {
        "type": "string",
        "enum": [
          "VALIDATION_START_DATE",
          "CREATION_DATE",
          "STILL_SINCE_DATE",
          "LATE_DATE",
          "END_DATE",
          "TASK_ID",
          "FOLDER_ID",
          "FOLDER_NAME",
          "TYPE_ID",
          "TYPE_NAME",
          "SUBTYPE_ID",
          "SUBTYPE_NAME",
          "ACTION_TYPE"
        ]
      },
      "MailParams": {
        "required": [
          "object",
          "to"
        ],
        "type": "object",
        "properties": {
          "publicAnnotation": {
            "maxLength": 255,
            "minLength": 0,
            "type": "string"
          },
          "privateAnnotation": {
            "maxLength": 255,
            "minLength": 0,
            "type": "string"
          },
          "metadata": {
            "type": "object",
            "additionalProperties": {
              "type": "string",
              "nullable": true
            },
            "nullable": true
          },
          "to": {
            "type": "array",
            "items": {
              "type": "string"
            }
          },
          "cc": {
            "type": "array",
            "items": {
              "type": "string"
            }
          },
          "bcc": {
            "type": "array",
            "items": {
              "type": "string"
            }
          },
          "object": {
            "type": "string"
          },
          "message": {
            "type": "string"
          },
          "password": {
            "type": "string"
          },
          "payload": {
            "type": "string"
          },
          "includeDocket": {
            "type": "boolean"
          }
        },
        "description": "body"
      },
      "PageFolderRepresentation": {
        "type": "object",
        "properties": {
          "totalElements": {
            "type": "integer",
            "format": "int64"
          },
          "totalPages": {
            "type": "integer",
            "format": "int32"
          },
          "size": {
            "type": "integer",
            "format": "int32"
          },
          "content": {
            "type": "array",
            "items": {
              "$ref": "#/components/schemas/FolderRepresentation"
            }
          },
          "number": {
            "type": "integer",
            "format": "int32"
          },
          "sort": {
            "$ref": "#/components/schemas/SortObject"
          },
          "numberOfElements": {
            "type": "integer",
            "format": "int32"
          },
          "pageable": {
            "$ref": "#/components/schemas/PageableObject"
          },
          "first": {
            "type": "boolean"
          },
          "last": {
            "type": "boolean"
          },
          "empty": {
            "type": "boolean"
          }
        }
      },
      "PageTenantRepresentation": {
        "type": "object",
        "properties": {
          "totalElements": {
            "type": "integer",
            "format": "int64"
          },
          "totalPages": {
            "type": "integer",
            "format": "int32"
          },
          "size": {
            "type": "integer",
            "format": "int32"
          },
          "content": {
            "type": "array",
            "items": {
              "$ref": "#/components/schemas/TenantRepresentation"
            }
          },
          "number": {
            "type": "integer",
            "format": "int32"
          },
          "sort": {
            "$ref": "#/components/schemas/SortObject"
          },
          "numberOfElements": {
            "type": "integer",
            "format": "int32"
          },
          "pageable": {
            "$ref": "#/components/schemas/PageableObject"
          },
          "first": {
            "type": "boolean"
          },
          "last": {
            "type": "boolean"
          },
          "empty": {
            "type": "boolean"
          }
        }
      },
      "PageableObject": {
        "type": "object",
        "properties": {
          "offset": {
            "type": "integer",
            "format": "int64"
          },
          "sort": {
            "$ref": "#/components/schemas/SortObject"
          },
          "pageSize": {
            "type": "integer",
            "format": "int32"
          },
          "paged": {
            "type": "boolean"
          },
          "pageNumber": {
            "type": "integer",
            "format": "int32"
          },
          "unpaged": {
            "type": "boolean"
          }
        }
      },
      "SimpleTaskParams": {
        "type": "object",
        "properties": {
          "publicAnnotation": {
            "maxLength": 255,
            "minLength": 0,
            "type": "string"
          },
          "privateAnnotation": {
            "maxLength": 255,
            "minLength": 0,
            "type": "string"
          },
          "metadata": {
            "type": "object",
            "additionalProperties": {
              "type": "string",
              "nullable": true
            },
            "nullable": true
          }
        }
      },
      "SortObject": {
        "type": "object",
        "properties": {
          "empty": {
            "type": "boolean"
          },
          "unsorted": {
            "type": "boolean"
          },
          "sorted": {
            "type": "boolean"
          }
        }
      },
      "State": {
        "type": "string",
        "enum": [
          "DRAFT",
          "LATE",
          "FINISHED",
          "CURRENT",
          "PENDING",
          "DELEGATED",
          "VALIDATED",
          "RETRIEVABLE",
          "UPCOMING",
          "REJECTED",
          "TRANSFERRED",
          "SECONDED",
          "BYPASSED",
          "DOWNSTREAM"
        ]
      },
      "TenantRepresentation": {
        "required": [
          "name"
        ],
        "type": "object",
        "properties": {
          "id": {
            "type": "string",
            "readOnly": true
          },
          "name": {
            "maxLength": 255,
            "minLength": 2,
            "pattern": "^[^\\r\\n\b ]*$",
            "type": "string",
            "example": "Example tenant"
          }
        }
      },
      "TenantSortBy": {
        "type": "string",
        "enum": [
          "NAME",
          "ID"
        ]
      }
    },
    "securitySchemes": {
      "spring_oauth": {
        "type": "oauth2",
        "description": "The following \"Authorize\" button will redirect you to the standard login page, fetch and store locally an authentication token. \\\nthat will be used for every Swagger method until its expiration.\n\nYou can manually get a token from command line, with the following command:\n\n$ curl --location \u0026#92;\\\n    --request POST \u0027http://localhost/auth/auth/realms/api/protocol/openid-connect/token\u0027 \u0026#92;\\\n    --header \u0027Content-Type: application/x-www-form-urlencoded\u0027 \u0026#92;\\\n    --data-urlencode \u0027password\u003dpassword\u0027 \u0026#92;\\\n    --data-urlencode \u0027username\u003duser\u0027 \u0026#92;\\\n    --data-urlencode \u0027client_id\u003dipcore-web\u0027 \u0026#92;\\\n    --data-urlencode \u0027grant_type\u003dpassword\u0027\n\n... and parse the .access_token path. It can be easily parsed with a :  ... | jq -r \u0027.access_token\u0027\n",
        "flows": {
          "authorizationCode": {
            "authorizationUrl": "./auth/realms/api/protocol/openid-connect/auth",
            "tokenUrl": "./auth/realms/api/protocol/openid-connect/token",
            "refreshUrl": "./auth/realms/api/protocol/openid-connect/token",
            "scopes": {}
          }
        }
      }
    }
  }
}