{
    "IdUtilisateurCourant" : 123456789,
    "ListeTypeDemandePaiement" : "FACTURE",
    "IdDestinataire" : 2015,
    "IdServiceExecutant" : 1111,
    "NumeroFacture" : "FACT001",
    "PeriodeDateDepotDu" : "2016-01-01",
    "PeriodeDateDepotAu" : "2016-01-20",
    "ListeTypeFacture" : "AVOIR",
    "IdFournisseur" : 000115552,
    "IdStructureValideur" : null,
    "CadreFacturation" : "A1",
    "StatutCourant" : "MISE_EN_PAIEMENT",
    "PeriodeDateFactureDu" : "2016-01-01",
    "PeriodeDateFactureAu" : "2016-01-20",
    "MontantHTMin" : 100.00,
    "MontantHTMax" : 10000.00,
    "MontantTTCMin" : 110.00,
    "MontantTTCMax" : 20000.00,
    "MontantApayerMin" : 110.00,
    "MontantApayerMax" : 20000.00,
    "NumeroMarche" : null,
    "NumeroBonCommande" : "BC1215",
    "FactureTelechargeeParDestinataire" : true,
    "NbResultatsMaximum" : 50,
    "PageResultatDemandee" : 50,
    "NbResultatsParPage" : 50,
    "TriSens" : "Ascendant",
    "TriColonne" : "NumeroFacture"
}