{
  "id_type_dossier": "draft-rh-archivage-collectif",
  "pastell-version": "%VERSION%",
  "timestamp": 1662358701,
  "raw_data": {
    "nom": "Données de gestion collective (fichier unitaire) (archivage) (Draft)",
    "type": "Ressources humaines",
    "etape": [
      {
        "type": "sae",
        "label": null,
        "requis": "on",
        "num_etape": 0,
        "automatique": "on",
        "defaultChecked": false,
        "specific_type_info": {
          "sae_has_metadata_in_json": ""
        },
        "num_etape_same_type": 0,
        "etape_with_same_type_exists": false
      }
    ],
    "nom_onglet": "Information",
    "description": "",
    "id_type_dossier": "draft-rh-archivage-collectif",
    "restriction_pack": "",
    "formulaireElement": [
      {
        "name": "Titre du document",
        "type": "text",
        "titre": "on",
        "requis": "on",
        "element_id": "titre_document",
        "preg_match": "",
        "commentaire": "",
        "content_type": "",
        "select_value": "",
        "champs_affiches": "",
        "preg_match_error": "",
        "champs_recherche_avancee": ""
      },
      {
        "name": "Num\u00e9ro SIRET de la collectivit\u00e9 territoriale",
        "type": "text",
        "titre": false,
        "requis": "on",
        "element_id": "siret_collectivite",
        "preg_match": "#^[0-9]{14}$#",
        "commentaire": "Numéro SIREN + numéro NIC (14 chiffres)",
        "content_type": "",
        "select_value": "",
        "champs_affiches": "",
        "preg_match_error": "Doit contenir 14 chiffres",
        "champs_recherche_avancee": ""
      },
      {
        "name": "Nom de la collectivit\u00e9 territoriale",
        "type": "text",
        "titre": false,
        "requis": "",
        "element_id": "nom_collectivite",
        "preg_match": "",
        "commentaire": "",
        "content_type": "",
        "select_value": "",
        "champs_affiches": "",
        "preg_match_error": "",
        "champs_recherche_avancee": ""
      },
      {
        "name": "Document",
        "type": "file",
        "titre": "",
        "requis": "on",
        "element_id": "document",
        "preg_match": "",
        "commentaire": "",
        "content_type": "",
        "select_value": "",
        "champs_affiches": "",
        "preg_match_error": "",
        "champs_recherche_avancee": ""
      },
      {
        "name": "Annexe(s)",
        "type": "multi_file",
        "titre": "",
        "requis": "",
        "element_id": "annexes",
        "preg_match": "",
        "commentaire": "",
        "content_type": "",
        "select_value": "",
        "champs_affiches": "",
        "preg_match_error": "",
        "champs_recherche_avancee": ""
      },
      {
        "name": "Fichier de m\u00e9tadonn\u00e9es",
        "type": "file",
        "titre": "",
        "requis": "",
        "element_id": "metadonnees",
        "preg_match": "",
        "commentaire": "",
        "content_type": "application\/json, application\/xml",
        "select_value": "",
        "champs_affiches": "",
        "preg_match_error": "",
        "champs_recherche_avancee": ""
      }
    ]
  }
}