{
  "id_type_dossier": "draft-dossier-autorisation-urbanisme",
  "pastell-version": "%VERSION%",
  "timestamp": 1633501524,
  "raw_data": {
    "id_type_dossier": "draft-dossier-autorisation-urbanisme",
    "nom": "Archivage des dossiers d'autorisation d'urbanisme (archivage) (Draft)",
    "type": "Urbanisme",
    "description": "Permet d'envoyer un dossier d'autorisation d'urbanisme dans un syst\u00e8me d'archivage \u00e9lectronique",
    "nom_onglet": "Information",
    "formulaireElement": [
      {
        "element_id": "titre",
        "name": "Titre",
        "type": "text",
        "commentaire": "",
        "requis": "on",
        "champs_affiches": "",
        "champs_recherche_avancee": "",
        "titre": "on",
        "select_value": "",
        "preg_match": "",
        "preg_match_error": ""
      },
      {
        "element_id": "id_dossier_externe",
        "name": "Identifiant du dossier sur l'application m\u00e9tier",
        "type": "text",
        "commentaire": "",
        "requis": "",
        "champs_affiches": "on",
        "champs_recherche_avancee": "on",
        "titre": "",
        "select_value": "",
        "preg_match": "",
        "preg_match_error": ""
      },
      {
        "element_id": "dossier",
        "name": "Dossier",
        "type": "file",
        "commentaire": "Au format ZIP uniquement",
        "requis": "on",
        "champs_affiches": "",
        "champs_recherche_avancee": "",
        "titre": "",
        "select_value": "",
        "preg_match": "",
        "preg_match_error": ""
      },
      {
        "element_id": "metadonnees",
        "name": "Fichier contenant les m\u00e9tadonn\u00e9es",
        "type": "file",
        "commentaire": "",
        "requis": "",
        "champs_affiches": "",
        "champs_recherche_avancee": "",
        "titre": "",
        "select_value": "",
        "preg_match": "",
        "preg_match_error": ""
      }
    ],
    "etape": [
      {
        "num_etape": 0,
        "type": "sae",
        "label": null,
        "defaultChecked": false,
        "requis": "on",
        "automatique": "on",
        "specific_type_info": {
          "sae_has_metadata_in_json": ""
        },
        "num_etape_same_type": 0,
        "etape_with_same_type_exists": false
      }
    ]
  }
}
