{
  "id_type_dossier": "draft-document-autorisation-urbanisme",
  "pastell-version": "%VERSION%",
  "timestamp": 1633501552,
  "raw_data": {
    "id_type_dossier": "draft-document-autorisation-urbanisme",
    "nom": "Document d'autorisation d'urbanisme (Draft)",
    "type": "Urbanisme",
    "description": "",
    "nom_onglet": "Information",
    "formulaireElement": [
      {
        "element_id": "titre",
        "name": "Titre",
        "type": "text",
        "commentaire": "Titre du document",
        "requis": "on",
        "champs_affiches": "",
        "champs_recherche_avancee": "",
        "titre": "on",
        "select_value": "",
        "preg_match": "",
        "preg_match_error": ""
      },
      {
        "element_id": "id_document_externe",
        "name": "Identifiant du document sur l'application m\u00e9tier",
        "type": "text",
        "commentaire": "",
        "requis": "",
        "champs_affiches": "on",
        "champs_recherche_avancee": "on",
        "titre": "",
        "select_value": "",
        "preg_match": "",
        "preg_match_error": ""
      },
      {
        "element_id": "document",
        "name": "Document",
        "type": "file",
        "commentaire": "",
        "requis": "on",
        "champs_affiches": "",
        "champs_recherche_avancee": "",
        "titre": false,
        "select_value": "",
        "preg_match": "",
        "preg_match_error": ""
      },
      {
        "element_id": "annexe",
        "name": "Annexe(s)",
        "type": "multi_file",
        "commentaire": "",
        "requis": "",
        "champs_affiches": "",
        "champs_recherche_avancee": "",
        "titre": false,
        "select_value": "",
        "preg_match": "",
        "preg_match_error": ""
      },
      {
        "element_id": "metadonnees",
        "name": "Fichier contenant les m\u00e9tadonn\u00e9es",
        "type": "file",
        "commentaire": "Pr\u00e9f\u00e9rentiellement au format JSON, XML possible",
        "requis": "",
        "champs_affiches": "",
        "champs_recherche_avancee": "",
        "titre": "",
        "select_value": "",
        "preg_match": "",
        "preg_match_error": ""
      }
    ],
    "etape": [
      {
        "num_etape": 0,
        "type": "transformation",
        "label": "Extraction des métadonnées",
        "defaultChecked": false,
        "requis": "on",
        "automatique": "on",
        "specific_type_info": [],
        "num_etape_same_type": 0,
        "etape_with_same_type_exists": false
      },
      {
        "num_etape": 1,
        "type": "signature",
        "label": null,
        "defaultChecked": false,
        "requis": "",
        "automatique": "on",
        "specific_type_info": {
          "libelle_parapheur": "titre",
          "document_a_signer": "document",
          "annexe": "annexe",
          "has_date_limite": "on",
          "has_metadata_in_json": "",
          "continue_after_refusal": ""
        },
        "num_etape_same_type": 0,
        "etape_with_same_type_exists": false
      },
      {
        "num_etape": 2,
        "type": "tdt_actes",
        "label": "Envoi au contrôle de légalité",
        "defaultChecked": false,
        "requis": "",
        "automatique": "on",
        "specific_type_info": {
          "objet_acte": "titre",
          "fichier_acte": "document",
          "fichier_annexe": "annexe",
          "droit_specifique": ""
        },
        "num_etape_same_type": 0,
        "etape_with_same_type_exists": false
      },
      {
        "num_etape": 3,
        "type": "mailsec",
        "label": null,
        "defaultChecked": false,
        "requis": "",
        "automatique": "on",
        "specific_type_info": [],
        "num_etape_same_type": 0,
        "etape_with_same_type_exists": false
      },
      {
        "num_etape": 4,
        "type": "depot",
        "label": "Versement entrepôts (GED, FTP, …)",
        "defaultChecked": false,
        "requis": "",
        "automatique": "on",
        "specific_type_info": [],
        "num_etape_same_type": 0,
        "etape_with_same_type_exists": false
      },
      {
        "num_etape": 5,
        "type": "sae",
        "label": "Système d'Archivage Électronique",
        "defaultChecked": false,
        "requis": "",
        "automatique": "on",
        "specific_type_info": {
          "sae_has_metadata_in_json": ""
        },
        "num_etape_same_type": 0,
        "etape_with_same_type_exists": false
      }
    ]
  }
}
