{
  "version": "1.0",
  "archival_agency_identifier": "Pastell_SA",
  "archival_agency_name": "Pastell",
  "transferring_agency_identifier": "Pastell_SA",
  "transferring_agency_name": "Pastell",
  "originating_agency_identifier": "Pastell_SA",
  "originating_agency_name": "Pastell",
  "commentaire": "commentaire",
  "titre": "titre",
  "archival_agreement": "ac_pastell_recette",
  "ArchivalProfile": "",
  "Language": "fr",
  "DescriptionLanguage": "fr",
  "DescriptionLevel": "Item",
  "archiveunits_title": "description_unite_archive_principale",
  "StartDate": "",
  "EndDate": "",
  "CustodialHistory": "",
  "AccessRule_Rule": "",
  "AccessRule_StartDate": "",
  "AppraisalRule_Rule": "APP10Y",
  "AppraisalRule_StartDate": "",
  "AppraisalRule_FinalAction": "D\u00e9truire",
  "keywords": "{{ titre }}\r\nautre mot cl\u00e9",
  "ServiceLevel": "",
  "OriginatingAgencyArchiveIdentifier": "",
  "TransferringAgencyArchiveIdentifier": "{{ titre }}",
  "ArchiveUnit_ExternalReference": "{{ id_document_externe }}"
}