{
  "id_type_dossier": "draft-rh-bulletin-salaire",
  "pastell-version": "%VERSION%",
  "timestamp": 1662358710,
  "raw_data": {
    "nom": "Bulletin de salaire (Draft)",
    "type": "Ressources humaines",
    "etape": [
      {
        "type": "transformation",
        "label": null,
        "requis": "on",
        "num_etape": 0,
        "automatique": "on",
        "defaultChecked": false,
        "specific_type_info": [],
        "num_etape_same_type": 0,
        "etape_with_same_type_exists": false
      },
      {
        "type": "signature",
        "label": null,
        "requis": "",
        "num_etape": 1,
        "automatique": "on",
        "defaultChecked": false,
        "specific_type_info": {
          "annexe": "annexes",
          "has_date_limite": "on",
          "document_a_signer": "document",
          "libelle_parapheur": "titre_document",
          "has_metadata_in_json": "",
          "continue_after_refusal": ""
        },
        "num_etape_same_type": 0,
        "etape_with_same_type_exists": false
      },
      {
        "type": "mailsec",
        "label": "",
        "requis": "",
        "num_etape": 2,
        "automatique": "on",
        "defaultChecked": false,
        "specific_type_info": [],
        "num_etape_same_type": 0,
        "etape_with_same_type_exists": false
      },
      {
        "type": "depot",
        "label": "",
        "requis": "",
        "num_etape": 3,
        "automatique": "on",
        "defaultChecked": false,
        "specific_type_info": [],
        "num_etape_same_type": 0,
        "etape_with_same_type_exists": false
      },
      {
        "type": "sae",
        "label": null,
        "requis": "",
        "num_etape": 4,
        "automatique": "on",
        "defaultChecked": false,
        "specific_type_info": {
          "sae_has_metadata_in_json": ""
        },
        "num_etape_same_type": 0,
        "etape_with_same_type_exists": false
      }
    ],
    "nom_onglet": "Information",
    "description": "",
    "id_type_dossier": "draft-rh-bulletin-salaire",
    "restriction_pack": "",
    "formulaireElement": [
      {
        "name": "Titre du document",
        "type": "text",
        "titre": "on",
        "requis": "on",
        "element_id": "titre_document",
        "preg_match": "",
        "commentaire": "",
        "content_type": "",
        "select_value": "",
        "champs_affiches": "",
        "preg_match_error": "",
        "champs_recherche_avancee": ""
      },
      {
        "name": "Matricule de l'agent",
        "type": "text",
        "titre": "",
        "requis": "on",
        "element_id": "matricule_agent",
        "preg_match": "",
        "commentaire": "",
        "content_type": "",
        "select_value": "",
        "champs_affiches": "on",
        "preg_match_error": "",
        "champs_recherche_avancee": "on"
      },
      {
        "name": "Pr\u00e9nom de l'agent",
        "type": "text",
        "titre": "",
        "requis": "on",
        "element_id": "prenom_agent",
        "preg_match": "",
        "commentaire": "Premier pr\u00e9nom de l'agent",
        "content_type": "",
        "select_value": "",
        "champs_affiches": "",
        "preg_match_error": "",
        "champs_recherche_avancee": ""
      },
      {
        "name": "Pr\u00e9nom(s) suivant(s) de l'agent",
        "type": "text",
        "titre": "",
        "requis": "",
        "element_id": "prenoms_suivants_agent",
        "preg_match": "",
        "commentaire": "Autres pr\u00e9noms de l'agent s\u00e9par\u00e9 par des espaces",
        "content_type": "",
        "select_value": "",
        "champs_affiches": "",
        "preg_match_error": "",
        "champs_recherche_avancee": ""
      },
      {
        "name": "Nom d'usage de l'agent",
        "type": "text",
        "titre": "",
        "requis": "",
        "element_id": "nom_usage_agent",
        "preg_match": "",
        "commentaire": "",
        "content_type": "",
        "select_value": "",
        "champs_affiches": "",
        "preg_match_error": "",
        "champs_recherche_avancee": ""
      },
      {
        "name": "Nom de naissance de l'agent",
        "type": "text",
        "titre": "",
        "requis": "",
        "element_id": "nom_naissance_agent",
        "preg_match": "",
        "commentaire": "",
        "content_type": "",
        "select_value": "",
        "champs_affiches": "",
        "preg_match_error": "",
        "champs_recherche_avancee": ""
      },
      {
        "name": "Date de naissance de l'agent",
        "type": "date",
        "titre": "",
        "requis": "on",
        "element_id": "date_naissance_agent",
        "preg_match": "",
        "commentaire": "",
        "content_type": "",
        "select_value": "",
        "champs_affiches": "",
        "preg_match_error": "",
        "champs_recherche_avancee": ""
      },
      {
        "name": "Adresse email de l'agent",
        "type": "text",
        "titre": false,
        "requis": "on",
        "element_id": "email_agent",
        "preg_match": "",
        "commentaire": "",
        "content_type": "",
        "select_value": "",
        "champs_affiches": "",
        "preg_match_error": "",
        "champs_recherche_avancee": ""
      },
      {
        "name": "Num\u00e9ro de t\u00e9l\u00e9phone de l'agent",
        "type": "text",
        "titre": "",
        "requis": "",
        "element_id": "telephone_agent",
        "preg_match": "",
        "commentaire": "",
        "content_type": "",
        "select_value": "",
        "champs_affiches": "",
        "preg_match_error": "",
        "champs_recherche_avancee": ""
      },
      {
        "name": "M\u00e9tier de l'agent",
        "type": "text",
        "titre": "",
        "requis": "",
        "element_id": "metier_agent",
        "preg_match": "",
        "commentaire": "",
        "content_type": "",
        "select_value": "",
        "champs_affiches": "",
        "preg_match_error": "",
        "champs_recherche_avancee": ""
      },
      {
        "name": "Statut de l'agent",
        "type": "text",
        "titre": "",
        "requis": "",
        "element_id": "statut_agent",
        "preg_match": "",
        "commentaire": "",
        "content_type": "",
        "select_value": "",
        "champs_affiches": "",
        "preg_match_error": "",
        "champs_recherche_avancee": ""
      },
      {
        "name": "Grade de l'agent",
        "type": "text",
        "titre": "",
        "requis": "",
        "element_id": "grade_agent",
        "preg_match": "",
        "commentaire": "",
        "content_type": "",
        "select_value": "",
        "champs_affiches": "",
        "preg_match_error": "",
        "champs_recherche_avancee": ""
      },
      {
        "name": "Num\u00e9ro SIRET de la collectivit\u00e9 territoriale",
        "type": "text",
        "titre": false,
        "requis": "on",
        "element_id": "siret_collectivite",
        "preg_match": "#^[0-9]{14}$#",
        "commentaire": "Numéro SIREN + numéro NIC (14 chiffres)",
        "content_type": "",
        "select_value": "",
        "champs_affiches": "",
        "preg_match_error": "Doit contenir 14 chiffres",
        "champs_recherche_avancee": ""
      },
      {
        "name": "Nom de la collectivit\u00e9 territoriale",
        "type": "text",
        "titre": false,
        "requis": "",
        "element_id": "nom_collectivite",
        "preg_match": "",
        "commentaire": "",
        "content_type": "",
        "select_value": "",
        "champs_affiches": "",
        "preg_match_error": "",
        "champs_recherche_avancee": ""
      },
      {
        "name": "Date du document",
        "type": "date",
        "titre": false,
        "requis": "on",
        "element_id": "date_document",
        "preg_match": "",
        "commentaire": "",
        "content_type": "",
        "select_value": "",
        "champs_affiches": "",
        "preg_match_error": "",
        "champs_recherche_avancee": ""
      },
      {
        "name": "Mois de la p\u00e9riode du bulletin de salaire",
        "type": "text",
        "titre": "",
        "requis": "on",
        "element_id": "mois_bulletin",
        "preg_match": "",
        "commentaire": "",
        "content_type": "",
        "select_value": "",
        "champs_affiches": "",
        "preg_match_error": "",
        "champs_recherche_avancee": ""
      },
      {
        "name": "Ann\u00e9e de la p\u00e9riode du bulletin de salaire",
        "type": "text",
        "titre": "",
        "requis": "on",
        "element_id": "annee_bulletin",
        "preg_match": "",
        "commentaire": "",
        "content_type": "",
        "select_value": "",
        "champs_affiches": "",
        "preg_match_error": "",
        "champs_recherche_avancee": ""
      },
      {
        "name": "Bulletin de salaire",
        "type": "file",
        "titre": "",
        "requis": "on",
        "element_id": "document",
        "preg_match": "",
        "commentaire": "",
        "content_type": "application\/pdf",
        "select_value": "",
        "champs_affiches": "",
        "preg_match_error": "",
        "champs_recherche_avancee": ""
      },
      {
        "name": "Annexe(s)",
        "type": "multi_file",
        "titre": "",
        "requis": "",
        "element_id": "annexes",
        "preg_match": "",
        "commentaire": "",
        "content_type": "",
        "select_value": "",
        "champs_affiches": "",
        "preg_match_error": "",
        "champs_recherche_avancee": ""
      },
      {
        "name": "Fichier de m\u00e9tadonn\u00e9es",
        "type": "file",
        "titre": "",
        "requis": "",
        "element_id": "metadonnees",
        "preg_match": "",
        "commentaire": "",
        "content_type": "application\/json, application\/xml",
        "select_value": "",
        "champs_affiches": "",
        "preg_match_error": "",
        "champs_recherche_avancee": ""
      }
    ]
  }
}