{
  "id_type_dossier": "draft-rh-bulletin-salaire-destinataire",
  "pastell-version": "%VERSION%",
  "timestamp": 1676890660,
  "raw_data": {
    "id_type_dossier": "draft-rh-bulletin-salaire-destinataire",
    "nom": "Bulletin de salaire (destinataire) (Draft)",
    "type": "Ressources humaines",
    "description": "",
    "nom_onglet": "Information",
    "restriction_pack": "",
    "formulaireElement": [
      {
        "element_id": "titre_document",
        "name": "Titre du document",
        "type": "text",
        "commentaire": "",
        "requis": "on",
        "champs_affiches": "",
        "champs_recherche_avancee": "",
        "titre": "on",
        "select_value": "",
        "preg_match": "",
        "default_value": false,
        "preg_match_error": "",
        "content_type": ""
      },
      {
        "element_id": "matricule_agent",
        "name": "Matricule de l'agent",
        "type": "text",
        "commentaire": "",
        "requis": "on",
        "champs_affiches": "on",
        "champs_recherche_avancee": "on",
        "titre": "",
        "select_value": "",
        "preg_match": "",
        "default_value": false,
        "preg_match_error": "",
        "content_type": ""
      },
      {
        "element_id": "prenom_agent",
        "name": "Pr\u00e9nom de l'agent",
        "type": "text",
        "commentaire": "Premier pr\u00e9nom de l'agent",
        "requis": "on",
        "champs_affiches": "",
        "champs_recherche_avancee": "",
        "titre": "",
        "select_value": "",
        "preg_match": "",
        "default_value": false,
        "preg_match_error": "",
        "content_type": ""
      },
      {
        "element_id": "prenoms_suivants_agent",
        "name": "Pr\u00e9nom(s) suivant(s) de l'agent",
        "type": "text",
        "commentaire": "Autres pr\u00e9noms de l'agent s\u00e9par\u00e9 par des espaces",
        "requis": "",
        "champs_affiches": "",
        "champs_recherche_avancee": "",
        "titre": "",
        "select_value": "",
        "preg_match": "",
        "default_value": false,
        "preg_match_error": "",
        "content_type": ""
      },
      {
        "element_id": "nom_usage_agent",
        "name": "Nom d'usage de l'agent",
        "type": "text",
        "commentaire": "",
        "requis": "",
        "champs_affiches": "",
        "champs_recherche_avancee": "",
        "titre": "",
        "select_value": "",
        "preg_match": "",
        "default_value": false,
        "preg_match_error": "",
        "content_type": ""
      },
      {
        "element_id": "nom_naissance_agent",
        "name": "Nom de naissance de l'agent",
        "type": "text",
        "commentaire": "",
        "requis": "",
        "champs_affiches": "",
        "champs_recherche_avancee": "",
        "titre": "",
        "select_value": "",
        "preg_match": "",
        "default_value": false,
        "preg_match_error": "",
        "content_type": ""
      },
      {
        "element_id": "date_naissance_agent",
        "name": "Date de naissance de l'agent",
        "type": "date",
        "commentaire": "",
        "requis": "on",
        "champs_affiches": "",
        "champs_recherche_avancee": "",
        "titre": "",
        "select_value": "",
        "preg_match": "",
        "default_value": false,
        "preg_match_error": "",
        "content_type": ""
      },
      {
        "element_id": "email_agent",
        "name": "Adresse email de l'agent",
        "type": "text",
        "commentaire": "",
        "requis": "on",
        "champs_affiches": "",
        "champs_recherche_avancee": "",
        "titre": false,
        "select_value": "",
        "preg_match": "",
        "default_value": false,
        "preg_match_error": "",
        "content_type": ""
      },
      {
        "element_id": "telephone_agent",
        "name": "Num\u00e9ro de t\u00e9l\u00e9phone de l'agent",
        "type": "text",
        "commentaire": "",
        "requis": "",
        "champs_affiches": "",
        "champs_recherche_avancee": "",
        "titre": "",
        "select_value": "",
        "preg_match": "",
        "default_value": false,
        "preg_match_error": "",
        "content_type": ""
      },
      {
        "element_id": "metier_agent",
        "name": "M\u00e9tier de l'agent",
        "type": "text",
        "commentaire": "",
        "requis": "",
        "champs_affiches": "",
        "champs_recherche_avancee": "",
        "titre": "",
        "select_value": "",
        "preg_match": "",
        "default_value": false,
        "preg_match_error": "",
        "content_type": ""
      },
      {
        "element_id": "statut_agent",
        "name": "Statut de l'agent",
        "type": "text",
        "commentaire": "",
        "requis": "",
        "champs_affiches": "",
        "champs_recherche_avancee": "",
        "titre": "",
        "select_value": "",
        "preg_match": "",
        "default_value": false,
        "preg_match_error": "",
        "content_type": ""
      },
      {
        "element_id": "grade_agent",
        "name": "Grade de l'agent",
        "type": "text",
        "commentaire": "",
        "requis": "",
        "champs_affiches": "",
        "champs_recherche_avancee": "",
        "titre": "",
        "select_value": "",
        "preg_match": "",
        "default_value": false,
        "preg_match_error": "",
        "content_type": ""
      },
      {
        "element_id": "siret_collectivite",
        "name": "Num\u00e9ro SIRET de la collectivit\u00e9 territoriale",
        "type": "text",
        "commentaire": "Numéro SIREN + numéro NIC (14 chiffres)",
        "requis": "on",
        "champs_affiches": "",
        "champs_recherche_avancee": "",
        "titre": false,
        "select_value": "",
        "preg_match": "#^[0-9]{14}$#",
        "default_value": false,
        "preg_match_error": "Doit contenir 14 chiffres",
        "content_type": ""
      },
      {
        "element_id": "nom_collectivite",
        "name": "Nom de la collectivit\u00e9 territoriale",
        "type": "text",
        "commentaire": "",
        "requis": "",
        "champs_affiches": "",
        "champs_recherche_avancee": "",
        "titre": false,
        "select_value": "",
        "preg_match": "",
        "default_value": false,
        "preg_match_error": "",
        "content_type": ""
      },
      {
        "element_id": "date_document",
        "name": "Date du document",
        "type": "date",
        "commentaire": "",
        "requis": "on",
        "champs_affiches": "",
        "champs_recherche_avancee": "",
        "titre": false,
        "select_value": "",
        "preg_match": "",
        "default_value": false,
        "preg_match_error": "",
        "content_type": ""
      },
      {
        "element_id": "mois_bulletin",
        "name": "Mois de la p\u00e9riode du bulletin de salaire",
        "type": "text",
        "commentaire": "",
        "requis": "on",
        "champs_affiches": "",
        "champs_recherche_avancee": "",
        "titre": "",
        "select_value": "",
        "preg_match": "",
        "default_value": false,
        "preg_match_error": "",
        "content_type": ""
      },
      {
        "element_id": "annee_bulletin",
        "name": "Ann\u00e9e de la p\u00e9riode du bulletin de salaire",
        "type": "text",
        "commentaire": "",
        "requis": "on",
        "champs_affiches": "",
        "champs_recherche_avancee": "",
        "titre": "",
        "select_value": "",
        "preg_match": "",
        "default_value": false,
        "preg_match_error": "",
        "content_type": ""
      },
      {
        "element_id": "document",
        "name": "Bulletin de salaire",
        "type": "file",
        "commentaire": "",
        "requis": "on",
        "champs_affiches": "",
        "champs_recherche_avancee": "",
        "titre": "",
        "select_value": "",
        "preg_match": "",
        "default_value": false,
        "preg_match_error": "",
        "content_type": "application\/pdf"
      },
      {
        "element_id": "annexes",
        "name": "Annexe(s)",
        "type": "multi_file",
        "commentaire": "",
        "requis": "",
        "champs_affiches": "",
        "champs_recherche_avancee": "",
        "titre": "",
        "select_value": "",
        "preg_match": "",
        "default_value": false,
        "preg_match_error": "",
        "content_type": ""
      }
    ],
    "etape": []
  }
}
