2,p.dumontet,Pierre,DUMONTET,cyril.weiller@libriciel.coop,3,06.87.89.67.54,Depute,,Floirac,Bureau|Commission|Conseil Communautaire Libriciel|New type
2,P.JUSSEAU,Paul,GRENADE,cyril.weiller@libriciel.coop,2,,,
2,T.AUCLAIR,Thierry,AUCLAIR,cyril.weiller@libriciel.coop,3,0687896754,senateur,
