////////////////////////////////////////////////////////////////////////////////////////////////////
// VERSAE Version
//
// @copyright (c) 2025, Libriciel
// @license   https://www.gnu.org/licenses/agpl-3.0.txt
////////////////////////////////////////////////////////////////////////////////////////////////////
1.1.3
