{
  "App": {
    "defaultLocale": "fr_FR",
    "paths": {
      "data": "\/data"
    },
    "fullBaseUrl": "https:\/\/localhost"
  },
  "Datasources": {
    "default": {
      "className": "Cake\\Database\\Connection",
      "driver": "Cake\\Database\\Driver\\Postgres",
      "database": "mink",
      "host": "db",
      "username": "mink",
      "password": "mink"
    },
    "debug_kit": {
      "driver": "Cake\\Database\\Driver\\Sqlite",
      "database": ":memory:",
      "memory": true
    },
    "test": {
      "driver": "Cake\\Database\\Driver\\Sqlite",
      "database": ":memory:",
      "memory": true
    },
    "mink": {
      "className": "Cake\\Database\\Connection",
      "driver": "Cake\\Database\\Driver\\Postgres",
      "database": "mink",
      "host": "db",
      "username": "mink",
      "password": "mink"
    },
    "postgres": {
      "className": "Cake\\Database\\Connection",
      "driver": "Cake\\Database\\Driver\\Postgres",
      "database": "test",
      "host": "localhost",
      "username": "test",
      "password": "test"
    }
  },
  "Password": {
    "complexity": 1
  },
  "Security": {
    "salt": "60b0a09523ffe011881ecc1e35623046de53204b8a4b736f1ce945bd0abf9581"
  },
  "debug": true,
  "CascadeDelete": {
    "debug": true
  }
}
