================================================================================
Liste des fichiers sample
================================================================================

--------------------------------------------------------------------------------
TEXT
--------------------------------------------------------------------------------
txt
odt
docx


--------------------------------------------------------------------------------
PDF     - pronom    - version
--------------------------------------------------------------------------------
pdf     - fmt/18    - PDF 1.4
pdfa    - fmt/354   - PDF/A 1b


--------------------------------------------------------------------------------
CALC
--------------------------------------------------------------------------------
xls
xlsx
ods


--------------------------------------------------------------------------------
PRESENTATION
--------------------------------------------------------------------------------
pptx
odp


--------------------------------------------------------------------------------
IMAGE
--------------------------------------------------------------------------------
png
jpg
tiff
gif
svg
jp2
bmp


--------------------------------------------------------------------------------
AUDIO   - container - codec
--------------------------------------------------------------------------------
aac
flac
mp3
ogg     - ogg       - vorbis
opus    - ogg       - opus
ac3


--------------------------------------------------------------------------------
VIDEO   - container                 - codec_video   - codec_audio
--------------------------------------------------------------------------------
avi     - avi                       - mpeg4         - mp3
m2ts    - mpegts                    - mpeg2video    -
mkv     - matroska,webm             - h264          - aac
mp4     - mov,mp4,m4a,3gp,3g2,mj2   - h264          - aac
webm    - matroska,webm             - vp8           - vorbis