<?xml version="1.0" encoding="UTF-8" standalone="no"?>
<svg
   xmlns:dc="http://purl.org/dc/elements/1.1/"
   xmlns:cc="http://creativecommons.org/ns#"
   xmlns:rdf="http://www.w3.org/1999/02/22-rdf-syntax-ns#"
   xmlns:svg="http://www.w3.org/2000/svg"
   xmlns="http://www.w3.org/2000/svg"
   xmlns:sodipodi="http://sodipodi.sourceforge.net/DTD/sodipodi-0.dtd"
   xmlns:inkscape="http://www.inkscape.org/namespaces/inkscape"
   viewBox="0 0 512 512"
   version="1.1"
   id="svg4"
   sodipodi:docname="certificate-solid-arrow-down.svg"
   inkscape:version="0.92.5 (2060ec1f9f, 2020-04-08)">
  <metadata
     id="metadata10">
    <rdf:RDF>
      <cc:Work
         rdf:about="">
        <dc:format>image/svg+xml</dc:format>
        <dc:type
           rdf:resource="http://purl.org/dc/dcmitype/StillImage" />
      </cc:Work>
    </rdf:RDF>
  </metadata>
  <defs
     id="defs8" />
  <sodipodi:namedview
     pagecolor="#ffffff"
     bordercolor="#666666"
     borderopacity="1"
     objecttolerance="10"
     gridtolerance="10"
     guidetolerance="10"
     inkscape:pageopacity="0"
     inkscape:pageshadow="2"
     inkscape:window-width="3368"
     inkscape:window-height="1376"
     id="namedview6"
     showgrid="false"
     inkscape:zoom="0.081483008"
     inkscape:cx="2181.6201"
     inkscape:cy="-1494.3268"
     inkscape:window-x="72"
     inkscape:window-y="27"
     inkscape:window-maximized="1"
     inkscape:current-layer="svg4" />
  <path
     d="M 318.24805 0.001953125 C 312.05442 -0.091099609 305.78086 2.1645156 300.99023 7.2285156 L 292.48047 15.994141 C 292.56344 16.93604 292.61523 17.886582 292.61523 18.849609 L 292.61523 308.97461 L 332.44336 274.34961 C 346.76008 263.1588 367.73975 265.13345 379.48242 278.77734 C 391.22509 292.42122 389.15266 312.41466 374.83594 323.60547 L 279.78906 401.39258 C 273.39595 406.38982 265.67354 408.75489 258.03906 408.63477 C 257.87721 408.63687 257.71707 408.64648 257.55469 408.64648 C 257.03327 408.64648 256.51572 408.63067 256 408.60938 C 248.036 408.96686 239.90881 406.61277 233.23047 401.39258 L 138.18164 323.60547 C 123.86492 312.41466 121.79444 292.42123 133.53711 278.77734 C 145.27977 265.13345 166.25946 263.1588 180.57617 274.34961 L 222.49219 310.60742 L 222.49219 19.054688 L 211.01172 7.2285156 C 198.38172 -6.1224844 174.96355 -0.005515625 170.68555 17.896484 L 154.70117 80.568359 L 92.707031 62.900391 C 74.870031 57.906391 58.056875 74.738266 63.046875 92.572266 L 80.707031 154.58789 L 18.056641 170.57617 C 0.068640625 174.87717 -6.3094219 197.94306 7.3925781 210.91406 L 53.376953 255.91992 L 7.3925781 300.92383 C -6.3154219 313.90083 0.076640625 336.96367 18.056641 341.26367 L 80.705078 357.25391 L 63.044922 419.26758 C 58.053922 437.10558 74.873078 453.93145 92.705078 448.93945 L 154.69922 431.27148 L 170.68359 493.94336 C 175.12259 512.51836 198.38077 517.96133 211.00977 504.61133 L 256 458.60938 L 300.98828 504.61133 C 313.48828 518.09933 336.97645 512.09736 341.31445 493.94336 L 357.29883 431.27148 L 419.29297 448.93945 C 437.12897 453.93345 453.94313 437.10158 448.95312 419.26758 L 431.29297 357.25391 L 493.94141 341.26367 C 511.92841 336.96167 518.30747 313.89583 504.60547 300.92383 L 458.62109 255.91992 L 504.60742 210.91406 C 518.31542 197.93706 511.92336 174.87617 493.94336 170.57617 L 431.29297 154.58594 L 448.95312 92.570312 C 453.94412 74.732312 437.12497 57.908391 419.29297 62.900391 L 357.29883 80.566406 L 341.31445 17.896484 C 338.6707 6.8346094 328.57075 0.15704102 318.24805 0.001953125 z "
     id="path2" />
</svg>
