{
  "controllers": {
    "Admins": true,
    "ArchivingSystems": true,
    "AuthUrls": true,
    "Devs": {
      "debugMail": true
    },
    "Download": true,
    "Ldaps": true,
    "Mercure": true,
    "OrgEntities": {
      "add": true,
      "delete": true,
      "index": true
    },
    "Tasks": true,
    "Upload": true,
    "Users": {
      "add": true,
      "editByAdmin": true,
      "delete": true,
      "view": true
    },
    "Webservices": true
  }
}