[
  {"name":"ArchiveDestructionRequest","identifier":"ArchiveDestructionRequest","description":"Utilisé pour générer le code ArchiveDestructionIdentifier du bordereau d'élimination d'archive.","definition_mask":"ADR_#s#","type":"interne","active":true},
  {"name":"ArchiveDeliveryRequest","identifier":"ArchiveDeliveryRequest","description":"Utilisé pour générer le code DeliveryRequestIdentifier du bordereau de demande de communication d'archives.","definition_mask":"ADLR_#s#","type":"interne","active":true},
  {"name":"ArchiveDelivery","identifier":"ArchiveDelivery","description":"Utilisé pour générer le code DeliveryIdentifier du bordereau de communication d'archive.","definition_mask":"ADL_#s#","type":"interne","active":true},
  {"name":"ArchiveDestructionNotification","identifier":"ArchiveDestructionNotification","description":"Utilisé pour générer le code DestructionNotificationIdentifier du bordereau de notification d'élimination d'archives.","definition_mask":"ADN_#s#","type":"interne","active":true},
  {"name":"Archiverestitutionrequestreply","identifier":"Archiverestitutionrequestreply","description":"Utilisé pour générer le code RestitutionRequestReplyIdentifier ainsi que le nom du fichier d'échange XML.","definition_mask":"ARRR_#s#","type":"interne","active":true},
  {"name":"ArchiveRestitutionRequest","identifier":"ArchiveRestitutionRequest","description":"Utilisé pour générer le code RestitutionRequestIdentifier du bordereau de demande de restitution d'archives.","definition_mask":"ARR_#s#","type":"interne","active":true},
  {"name":"ArchiveRestitution","identifier":"ArchiveRestitution","description":"Utilisé pour générer le code RestitutionIdentifier du bordereau de restitution d'archives.","definition_mask":"AR_#s#","type":"interne","active":true},
  {"name":"Archivedestructionrequestreply","identifier":"Archivedestructionrequestreply","description":"Utilisé pour générer le code DestructionRequestReplyIdentifier ainsi que le nom du fichier d'échange XML.","definition_mask":"ADRR_#s#","type":"interne","active":true},
  {"name":"Archivedeliveryrequestreply","identifier":"Archivedeliveryrequestreply","description":"Utilisé pour générer le code DeliveryRequestReplyIdentifier ainsi que le nom du fichier d''échange XML.","definition_mask":"ADLRR_#s#","type":"interne","active":true},
  {"name":"ArchivalAgencyArchiveIdentifier","identifier":"ArchivalAgencyArchiveIdentifier","description":"Utilisé pour donner un numéro aux archives","definition_mask":"#s#","type":"interne","active":true},
  {"name":"ArchiveTransferReply","identifier":"ArchiveTransferReply","description":"Utilisé pour générer le code TransferReplyIdentifier ainsi que le nom du fichier d'échange XML.","definition_mask":"ATR_#s#","type":"interne","active":true},
  {"name":"ArchiveTransferAcceptance","identifier":"ArchiveTransferAcceptance","description":"Utilisé pour générer le code TransferAcceptanceIdentifier ainsi que le nom du fichier d'échange XML.","definition_mask":"ATA_#s#","type":"interne","active":true},
  {"name":"ArchiveTransfer","identifier":"ArchiveTransfer","description":"Utilisé pour générer le code TransferIdentifier des bordereaux de transfert.","definition_mask":"AT_#s#","type":"interne","active":true},
  {"name":"AcknowledgementIdentifier","identifier":"AcknowledgementIdentifier","description":"Utilisé pour générer le code AcknowledgementIdentifier du message d'accusé de réception.","definition_mask":"ACK_#s#","type":"interne","active":true},
  {"name":"OutgoingTransferRequest","identifier":"OutgoingTransferRequest","description":"Utilisé pour générer les identifiants des demandes de transferts sortants.","definition_mask":"OATR_#s#","type":"interne","active":true},
  {"name":"OutgoingTransfer","identifier":"OutgoingTransfer","description":"Utilisé pour générer les identifiants des transferts sortants.","definition_mask":"OAT_#s#","type":"interne","active":true}
]