{
  "data": [
    {
      "id": "00a6efd2-5ed5-11ef-8122-0242ac150004",
      "legacyId": null,
      "instanceId": "00a6c89e-5ed5-11ef-8122-0242ac150004",
      "instanceName": "Ma demande de congé",
      "expectedAction": "START",
      "performedAction": null,
      "notificationType": null,
      "beginDate": "2024-08-20T09:17:20.375+00:00",
      "dueDate": null,
      "date": null,
      "candidateGroups": [
        "Direction du développement"
      ],
      "notifiedGroups": null,
      "mandatoryValidationMetadata": null,
      "mandatoryRejectionMetadata": null,
      "assignee": null,
      "delegatedByGroupId": null,
      "pending": false,
      "variables": {
        "i_Parapheur_internal_creation_date": "2024-08-20T11:17:20.375+0200",
        "workflow_internal_validation_workflow_id": "visa_conge:1:f5ead0bf-5ed0-11ef-8122-0242ac150004"
      },
      "externalState": null,
      "state": "DRAFT",
      "readByUserIds": [],
      "workflowIndex": 0,
      "stepIndex": null,
      "visibility": "PUBLIC",
      "originGroup": "Direction du développement",
      "finalGroup": "Direction du développement"
    },
    {
      "id": "03cda0ba-5ed4-11ef-8122-0242ac150004",
      "legacyId": null,
      "instanceId": "03cc4106-5ed4-11ef-8122-0242ac150004",
      "instanceName": "Ma demande de congé",
      "expectedAction": "START",
      "performedAction": null,
      "notificationType": null,
      "beginDate": "2024-08-20T09:10:16.157+00:00",
      "dueDate": null,
      "date": null,
      "candidateGroups": [
        "Direction du développement"
      ],
      "notifiedGroups": null,
      "mandatoryValidationMetadata": null,
      "mandatoryRejectionMetadata": null,
      "assignee": null,
      "delegatedByGroupId": null,
      "pending": false,
      "variables": {
        "i_Parapheur_internal_creation_date": "2024-08-20T11:10:16.156+0200",
        "workflow_internal_validation_workflow_id": "visa_conge:1:f5ead0bf-5ed0-11ef-8122-0242ac150004"
      },
      "externalState": null,
      "state": "DRAFT",
      "readByUserIds": [],
      "workflowIndex": 0,
      "stepIndex": null,
      "visibility": "PUBLIC",
      "originGroup": "Direction du développement",
      "finalGroup": "Direction du développement"
    },
    {
      "id": "05ee1a68-5ed5-11ef-8122-0242ac150004",
      "legacyId": null,
      "instanceId": "05edcc24-5ed5-11ef-8122-0242ac150004",
      "instanceName": "Ma demande de congé",
      "expectedAction": "START",
      "performedAction": null,
      "notificationType": null,
      "beginDate": "2024-08-20T09:17:29.229+00:00",
      "dueDate": null,
      "date": null,
      "candidateGroups": [
        "Direction du développement"
      ],
      "notifiedGroups": null,
      "mandatoryValidationMetadata": null,
      "mandatoryRejectionMetadata": null,
      "assignee": null,
      "delegatedByGroupId": null,
      "pending": false,
      "variables": {
        "i_Parapheur_internal_creation_date": "2024-08-20T11:17:29.229+0200",
        "workflow_internal_validation_workflow_id": "visa_conge:1:f5ead0bf-5ed0-11ef-8122-0242ac150004"
      },
      "externalState": null,
      "state": "DRAFT",
      "readByUserIds": [],
      "workflowIndex": 0,
      "stepIndex": null,
      "visibility": "PUBLIC",
      "originGroup": "Direction du développement",
      "finalGroup": "Direction du développement"
    },
    {
      "id": "0d789aa0-5ed4-11ef-8122-0242ac150004",
      "legacyId": null,
      "instanceId": "0d77fe3c-5ed4-11ef-8122-0242ac150004",
      "instanceName": "Ma demande de congé",
      "expectedAction": "START",
      "performedAction": null,
      "notificationType": null,
      "beginDate": "2024-08-20T09:10:32.382+00:00",
      "dueDate": null,
      "date": null,
      "candidateGroups": [
        "Direction du développement"
      ],
      "notifiedGroups": null,
      "mandatoryValidationMetadata": null,
      "mandatoryRejectionMetadata": null,
      "assignee": null,
      "delegatedByGroupId": null,
      "pending": false,
      "variables": {
        "i_Parapheur_internal_creation_date": "2024-08-20T11:10:32.382+0200",
        "workflow_internal_validation_workflow_id": "visa_conge:1:f5ead0bf-5ed0-11ef-8122-0242ac150004"
      },
      "externalState": null,
      "state": "DRAFT",
      "readByUserIds": [],
      "workflowIndex": 0,
      "stepIndex": null,
      "visibility": "PUBLIC",
      "originGroup": "Direction du développement",
      "finalGroup": "Direction du développement"
    },
    {
      "id": "17009452-5eda-11ef-8122-0242ac150004",
      "legacyId": null,
      "instanceId": "1700460e-5eda-11ef-8122-0242ac150004",
      "instanceName": "Ma demande de congé",
      "expectedAction": "START",
      "performedAction": null,
      "notificationType": null,
      "beginDate": "2024-08-20T09:53:45.355+00:00",
      "dueDate": null,
      "date": null,
      "candidateGroups": [
        "Direction du développement"
      ],
      "notifiedGroups": null,
      "mandatoryValidationMetadata": null,
      "mandatoryRejectionMetadata": null,
      "assignee": null,
      "delegatedByGroupId": null,
      "pending": false,
      "variables": {
        "i_Parapheur_internal_creation_date": "2024-08-20T11:53:45.355+0200",
        "workflow_internal_validation_workflow_id": "visa_conge:1:f5ead0bf-5ed0-11ef-8122-0242ac150004"
      },
      "externalState": null,
      "state": "DRAFT",
      "readByUserIds": [],
      "workflowIndex": 0,
      "stepIndex": null,
      "visibility": "PUBLIC",
      "originGroup": "Direction du développement",
      "finalGroup": "Direction du développement"
    },
    {
      "id": "1aae737e-5ed5-11ef-8122-0242ac150004",
      "legacyId": null,
      "instanceId": "1aadfe2a-5ed5-11ef-8122-0242ac150004",
      "instanceName": "Ma demande de congé",
      "expectedAction": "START",
      "performedAction": null,
      "notificationType": null,
      "beginDate": "2024-08-20T09:18:04.043+00:00",
      "dueDate": null,
      "date": null,
      "candidateGroups": [
        "Direction du développement"
      ],
      "notifiedGroups": null,
      "mandatoryValidationMetadata": null,
      "mandatoryRejectionMetadata": null,
      "assignee": null,
      "delegatedByGroupId": null,
      "pending": false,
      "variables": {
        "i_Parapheur_internal_creation_date": "2024-08-20T11:18:04.043+0200",
        "workflow_internal_validation_workflow_id": "visa_conge:1:f5ead0bf-5ed0-11ef-8122-0242ac150004"
      },
      "externalState": null,
      "state": "DRAFT",
      "readByUserIds": [],
      "workflowIndex": 0,
      "stepIndex": null,
      "visibility": "PUBLIC",
      "originGroup": "Direction du développement",
      "finalGroup": "Direction du développement"
    },
    {
      "id": "1b99da66-5ed4-11ef-8122-0242ac150004",
      "legacyId": null,
      "instanceId": "1b993e02-5ed4-11ef-8122-0242ac150004",
      "instanceName": "Ma demande de congé",
      "expectedAction": "START",
      "performedAction": null,
      "notificationType": null,
      "beginDate": "2024-08-20T09:10:56.088+00:00",
      "dueDate": null,
      "date": null,
      "candidateGroups": [
        "Direction du développement"
      ],
      "notifiedGroups": null,
      "mandatoryValidationMetadata": null,
      "mandatoryRejectionMetadata": null,
      "assignee": null,
      "delegatedByGroupId": null,
      "pending": false,
      "variables": {
        "i_Parapheur_internal_creation_date": "2024-08-20T11:10:56.088+0200",
        "workflow_internal_validation_workflow_id": "visa_conge:1:f5ead0bf-5ed0-11ef-8122-0242ac150004"
      },
      "externalState": null,
      "state": "DRAFT",
      "readByUserIds": [],
      "workflowIndex": 0,
      "stepIndex": null,
      "visibility": "PUBLIC",
      "originGroup": "Direction du développement",
      "finalGroup": "Direction du développement"
    },
    {
      "id": "292a0844-5ed5-11ef-8122-0242ac150004",
      "legacyId": null,
      "instanceId": "2929e110-5ed5-11ef-8122-0242ac150004",
      "instanceName": "Ma demande de congé",
      "expectedAction": "START",
      "performedAction": null,
      "notificationType": null,
      "beginDate": "2024-08-20T09:18:28.343+00:00",
      "dueDate": null,
      "date": null,
      "candidateGroups": [
        "Direction du développement"
      ],
      "notifiedGroups": null,
      "mandatoryValidationMetadata": null,
      "mandatoryRejectionMetadata": null,
      "assignee": null,
      "delegatedByGroupId": null,
      "pending": false,
      "variables": {
        "i_Parapheur_internal_creation_date": "2024-08-20T11:18:28.342+0200",
        "workflow_internal_validation_workflow_id": "visa_conge:1:f5ead0bf-5ed0-11ef-8122-0242ac150004"
      },
      "externalState": null,
      "state": "DRAFT",
      "readByUserIds": [],
      "workflowIndex": 0,
      "stepIndex": null,
      "visibility": "PUBLIC",
      "originGroup": "Direction du développement",
      "finalGroup": "Direction du développement"
    },
    {
      "id": "2d546d8c-5ed4-11ef-8122-0242ac150004",
      "legacyId": null,
      "instanceId": "2d53f838-5ed4-11ef-8122-0242ac150004",
      "instanceName": "Ma demande de congé",
      "expectedAction": "START",
      "performedAction": null,
      "notificationType": null,
      "beginDate": "2024-08-20T09:11:25.833+00:00",
      "dueDate": null,
      "date": null,
      "candidateGroups": [
        "Direction du développement"
      ],
      "notifiedGroups": null,
      "mandatoryValidationMetadata": null,
      "mandatoryRejectionMetadata": null,
      "assignee": null,
      "delegatedByGroupId": null,
      "pending": false,
      "variables": {
        "i_Parapheur_internal_creation_date": "2024-08-20T11:11:25.833+0200",
        "workflow_internal_validation_workflow_id": "visa_conge:1:f5ead0bf-5ed0-11ef-8122-0242ac150004"
      },
      "externalState": null,
      "state": "DRAFT",
      "readByUserIds": [],
      "workflowIndex": 0,
      "stepIndex": null,
      "visibility": "PUBLIC",
      "originGroup": "Direction du développement",
      "finalGroup": "Direction du développement"
    },
    {
      "id": "3c3adc9a-5ed5-11ef-8122-0242ac150004",
      "legacyId": null,
      "instanceId": "3c3a8e56-5ed5-11ef-8122-0242ac150004",
      "instanceName": "Ma demande de congé",
      "expectedAction": "START",
      "performedAction": null,
      "notificationType": null,
      "beginDate": "2024-08-20T09:19:00.329+00:00",
      "dueDate": null,
      "date": null,
      "candidateGroups": [
        "Direction du développement"
      ],
      "notifiedGroups": null,
      "mandatoryValidationMetadata": null,
      "mandatoryRejectionMetadata": null,
      "assignee": null,
      "delegatedByGroupId": null,
      "pending": false,
      "variables": {
        "i_Parapheur_internal_creation_date": "2024-08-20T11:19:00.329+0200",
        "workflow_internal_validation_workflow_id": "visa_conge:1:f5ead0bf-5ed0-11ef-8122-0242ac150004"
      },
      "externalState": null,
      "state": "DRAFT",
      "readByUserIds": [],
      "workflowIndex": 0,
      "stepIndex": null,
      "visibility": "PUBLIC",
      "originGroup": "Direction du développement",
      "finalGroup": "Direction du développement"
    },
    {
      "id": "4f333c42-5ed4-11ef-8122-0242ac150004",
      "legacyId": null,
      "instanceId": "4f32c6ee-5ed4-11ef-8122-0242ac150004",
      "instanceName": "Ma demande de congé",
      "expectedAction": "START",
      "performedAction": null,
      "notificationType": null,
      "beginDate": "2024-08-20T09:12:22.658+00:00",
      "dueDate": null,
      "date": null,
      "candidateGroups": [
        "Direction du développement"
      ],
      "notifiedGroups": null,
      "mandatoryValidationMetadata": null,
      "mandatoryRejectionMetadata": null,
      "assignee": null,
      "delegatedByGroupId": null,
      "pending": false,
      "variables": {
        "i_Parapheur_internal_creation_date": "2024-08-20T11:12:22.658+0200",
        "workflow_internal_validation_workflow_id": "visa_conge:1:f5ead0bf-5ed0-11ef-8122-0242ac150004"
      },
      "externalState": null,
      "state": "DRAFT",
      "readByUserIds": [],
      "workflowIndex": 0,
      "stepIndex": null,
      "visibility": "PUBLIC",
      "originGroup": "Direction du développement",
      "finalGroup": "Direction du développement"
    },
    {
      "id": "555b7708-5ed4-11ef-8122-0242ac150004",
      "legacyId": null,
      "instanceId": "555b29c4-5ed4-11ef-8122-0242ac150004",
      "instanceName": "Ma demande de congé",
      "expectedAction": "START",
      "performedAction": null,
      "notificationType": null,
      "beginDate": "2024-08-20T09:12:32.989+00:00",
      "dueDate": null,
      "date": null,
      "candidateGroups": [
        "Direction du développement"
      ],
      "notifiedGroups": null,
      "mandatoryValidationMetadata": null,
      "mandatoryRejectionMetadata": null,
      "assignee": null,
      "delegatedByGroupId": null,
      "pending": false,
      "variables": {
        "i_Parapheur_internal_creation_date": "2024-08-20T11:12:32.988+0200",
        "workflow_internal_validation_workflow_id": "visa_conge:1:f5ead0bf-5ed0-11ef-8122-0242ac150004"
      },
      "externalState": null,
      "state": "DRAFT",
      "readByUserIds": [],
      "workflowIndex": 0,
      "stepIndex": null,
      "visibility": "PUBLIC",
      "originGroup": "Direction du développement",
      "finalGroup": "Direction du développement"
    },
    {
      "id": "62083f3e-5ed4-11ef-8122-0242ac150004",
      "legacyId": null,
      "instanceId": "6207c9ea-5ed4-11ef-8122-0242ac150004",
      "instanceName": "Ma demande de congé",
      "expectedAction": "START",
      "performedAction": null,
      "notificationType": null,
      "beginDate": "2024-08-20T09:12:54.253+00:00",
      "dueDate": null,
      "date": null,
      "candidateGroups": [
        "Direction du développement"
      ],
      "notifiedGroups": null,
      "mandatoryValidationMetadata": null,
      "mandatoryRejectionMetadata": null,
      "assignee": null,
      "delegatedByGroupId": null,
      "pending": false,
      "variables": {
        "i_Parapheur_internal_creation_date": "2024-08-20T11:12:54.252+0200",
        "workflow_internal_validation_workflow_id": "visa_conge:1:f5ead0bf-5ed0-11ef-8122-0242ac150004"
      },
      "externalState": null,
      "state": "DRAFT",
      "readByUserIds": [],
      "workflowIndex": 0,
      "stepIndex": null,
      "visibility": "PUBLIC",
      "originGroup": "Direction du développement",
      "finalGroup": "Direction du développement"
    },
    {
      "id": "6811f684-5ed4-11ef-8122-0242ac150004",
      "legacyId": null,
      "instanceId": "68118130-5ed4-11ef-8122-0242ac150004",
      "instanceName": "Ma demande de congé",
      "expectedAction": "START",
      "performedAction": null,
      "notificationType": null,
      "beginDate": "2024-08-20T09:13:04.383+00:00",
      "dueDate": null,
      "date": null,
      "candidateGroups": [
        "Direction du développement"
      ],
      "notifiedGroups": null,
      "mandatoryValidationMetadata": null,
      "mandatoryRejectionMetadata": null,
      "assignee": null,
      "delegatedByGroupId": null,
      "pending": false,
      "variables": {
        "i_Parapheur_internal_creation_date": "2024-08-20T11:13:04.383+0200",
        "workflow_internal_validation_workflow_id": "visa_conge:1:f5ead0bf-5ed0-11ef-8122-0242ac150004"
      },
      "externalState": null,
      "state": "DRAFT",
      "readByUserIds": [],
      "workflowIndex": 0,
      "stepIndex": null,
      "visibility": "PUBLIC",
      "originGroup": "Direction du développement",
      "finalGroup": "Direction du développement"
    },
    {
      "id": "73d437aa-5ed4-11ef-8122-0242ac150004",
      "legacyId": null,
      "instanceId": "73d3e966-5ed4-11ef-8122-0242ac150004",
      "instanceName": "Ma demande de congé",
      "expectedAction": "START",
      "performedAction": null,
      "notificationType": null,
      "beginDate": "2024-08-20T09:13:24.112+00:00",
      "dueDate": null,
      "date": null,
      "candidateGroups": [
        "Direction du développement"
      ],
      "notifiedGroups": null,
      "mandatoryValidationMetadata": null,
      "mandatoryRejectionMetadata": null,
      "assignee": null,
      "delegatedByGroupId": null,
      "pending": false,
      "variables": {
        "i_Parapheur_internal_creation_date": "2024-08-20T11:13:24.111+0200",
        "workflow_internal_validation_workflow_id": "visa_conge:1:f5ead0bf-5ed0-11ef-8122-0242ac150004"
      },
      "externalState": null,
      "state": "DRAFT",
      "readByUserIds": [],
      "workflowIndex": 0,
      "stepIndex": null,
      "visibility": "PUBLIC",
      "originGroup": "Direction du développement",
      "finalGroup": "Direction du développement"
    },
    {
      "id": "78365970-5ed4-11ef-8122-0242ac150004",
      "legacyId": null,
      "instanceId": "78360b2c-5ed4-11ef-8122-0242ac150004",
      "instanceName": "Ma demande de congé",
      "expectedAction": "START",
      "performedAction": null,
      "notificationType": null,
      "beginDate": "2024-08-20T09:13:31.466+00:00",
      "dueDate": null,
      "date": null,
      "candidateGroups": [
        "Direction du développement"
      ],
      "notifiedGroups": null,
      "mandatoryValidationMetadata": null,
      "mandatoryRejectionMetadata": null,
      "assignee": null,
      "delegatedByGroupId": null,
      "pending": false,
      "variables": {
        "i_Parapheur_internal_creation_date": "2024-08-20T11:13:31.466+0200",
        "workflow_internal_validation_workflow_id": "visa_conge:1:f5ead0bf-5ed0-11ef-8122-0242ac150004"
      },
      "externalState": null,
      "state": "DRAFT",
      "readByUserIds": [],
      "workflowIndex": 0,
      "stepIndex": null,
      "visibility": "PUBLIC",
      "originGroup": "Direction du développement",
      "finalGroup": "Direction du développement"
    },
    {
      "id": "8a7dea56-5ed4-11ef-8122-0242ac150004",
      "legacyId": null,
      "instanceId": "8a7d9c12-5ed4-11ef-8122-0242ac150004",
      "instanceName": "Ma demande de congé",
      "expectedAction": "START",
      "performedAction": null,
      "notificationType": null,
      "beginDate": "2024-08-20T09:14:02.134+00:00",
      "dueDate": null,
      "date": null,
      "candidateGroups": [
        "Direction du développement"
      ],
      "notifiedGroups": null,
      "mandatoryValidationMetadata": null,
      "mandatoryRejectionMetadata": null,
      "assignee": null,
      "delegatedByGroupId": null,
      "pending": false,
      "variables": {
        "i_Parapheur_internal_creation_date": "2024-08-20T11:14:02.133+0200",
        "workflow_internal_validation_workflow_id": "visa_conge:1:f5ead0bf-5ed0-11ef-8122-0242ac150004"
      },
      "externalState": null,
      "state": "DRAFT",
      "readByUserIds": [],
      "workflowIndex": 0,
      "stepIndex": null,
      "visibility": "PUBLIC",
      "originGroup": "Direction du développement",
      "finalGroup": "Direction du développement"
    },
    {
      "id": "8bf711a4-5ed3-11ef-8122-0242ac150004",
      "legacyId": null,
      "instanceId": "8bf340f0-5ed3-11ef-8122-0242ac150004",
      "instanceName": "Ma demande de congé",
      "expectedAction": "START",
      "performedAction": null,
      "notificationType": null,
      "beginDate": "2024-08-20T09:06:55.086+00:00",
      "dueDate": null,
      "date": null,
      "candidateGroups": [
        "Direction du développement"
      ],
      "notifiedGroups": null,
      "mandatoryValidationMetadata": null,
      "mandatoryRejectionMetadata": null,
      "assignee": null,
      "delegatedByGroupId": null,
      "pending": false,
      "variables": {
        "i_Parapheur_internal_creation_date": "2024-08-20T11:06:55.075+0200",
        "workflow_internal_validation_workflow_id": "visa_conge:1:f5ead0bf-5ed0-11ef-8122-0242ac150004"
      },
      "externalState": null,
      "state": "DRAFT",
      "readByUserIds": [],
      "workflowIndex": 0,
      "stepIndex": null,
      "visibility": "PUBLIC",
      "originGroup": "Direction du développement",
      "finalGroup": "Direction du développement"
    },
    {
      "id": "ab52c31c-5ed4-11ef-8122-0242ac150004",
      "legacyId": null,
      "instanceId": "ab5274d8-5ed4-11ef-8122-0242ac150004",
      "instanceName": "Ma demande de congé",
      "expectedAction": "START",
      "performedAction": null,
      "notificationType": null,
      "beginDate": "2024-08-20T09:14:57.216+00:00",
      "dueDate": null,
      "date": null,
      "candidateGroups": [
        "Direction du développement"
      ],
      "notifiedGroups": null,
      "mandatoryValidationMetadata": null,
      "mandatoryRejectionMetadata": null,
      "assignee": null,
      "delegatedByGroupId": null,
      "pending": false,
      "variables": {
        "i_Parapheur_internal_creation_date": "2024-08-20T11:14:57.216+0200",
        "workflow_internal_validation_workflow_id": "visa_conge:1:f5ead0bf-5ed0-11ef-8122-0242ac150004"
      },
      "externalState": null,
      "state": "DRAFT",
      "readByUserIds": [],
      "workflowIndex": 0,
      "stepIndex": null,
      "visibility": "PUBLIC",
      "originGroup": "Direction du développement",
      "finalGroup": "Direction du développement"
    },
    {
      "id": "ba35cb42-5ed4-11ef-8122-0242ac150004",
      "legacyId": null,
      "instanceId": "ba357dfe-5ed4-11ef-8122-0242ac150004",
      "instanceName": "Ma demande de congé",
      "expectedAction": "START",
      "performedAction": null,
      "notificationType": null,
      "beginDate": "2024-08-20T09:15:22.192+00:00",
      "dueDate": null,
      "date": null,
      "candidateGroups": [
        "Direction du développement"
      ],
      "notifiedGroups": null,
      "mandatoryValidationMetadata": null,
      "mandatoryRejectionMetadata": null,
      "assignee": null,
      "delegatedByGroupId": null,
      "pending": false,
      "variables": {
        "i_Parapheur_internal_creation_date": "2024-08-20T11:15:22.192+0200",
        "workflow_internal_validation_workflow_id": "visa_conge:1:f5ead0bf-5ed0-11ef-8122-0242ac150004"
      },
      "externalState": null,
      "state": "DRAFT",
      "readByUserIds": [],
      "workflowIndex": 0,
      "stepIndex": null,
      "visibility": "PUBLIC",
      "originGroup": "Direction du développement",
      "finalGroup": "Direction du développement"
    },
    {
      "id": "c0189998-5ed4-11ef-8122-0242ac150004",
      "legacyId": null,
      "instanceId": "c0184b54-5ed4-11ef-8122-0242ac150004",
      "instanceName": "Ma demande de congé",
      "expectedAction": "START",
      "performedAction": null,
      "notificationType": null,
      "beginDate": "2024-08-20T09:15:32.067+00:00",
      "dueDate": null,
      "date": null,
      "candidateGroups": [
        "Direction du développement"
      ],
      "notifiedGroups": null,
      "mandatoryValidationMetadata": null,
      "mandatoryRejectionMetadata": null,
      "assignee": null,
      "delegatedByGroupId": null,
      "pending": false,
      "variables": {
        "i_Parapheur_internal_creation_date": "2024-08-20T11:15:32.066+0200",
        "workflow_internal_validation_workflow_id": "visa_conge:1:f5ead0bf-5ed0-11ef-8122-0242ac150004"
      },
      "externalState": null,
      "state": "DRAFT",
      "readByUserIds": [],
      "workflowIndex": 0,
      "stepIndex": null,
      "visibility": "PUBLIC",
      "originGroup": "Direction du développement",
      "finalGroup": "Direction du développement"
    },
    {
      "id": "c81483ee-5ed4-11ef-8122-0242ac150004",
      "legacyId": null,
      "instanceId": "c81435aa-5ed4-11ef-8122-0242ac150004",
      "instanceName": "Ma demande de congé",
      "expectedAction": "START",
      "performedAction": null,
      "notificationType": null,
      "beginDate": "2024-08-20T09:15:45.462+00:00",
      "dueDate": null,
      "date": null,
      "candidateGroups": [
        "Direction du développement"
      ],
      "notifiedGroups": null,
      "mandatoryValidationMetadata": null,
      "mandatoryRejectionMetadata": null,
      "assignee": null,
      "delegatedByGroupId": null,
      "pending": false,
      "variables": {
        "i_Parapheur_internal_creation_date": "2024-08-20T11:15:45.461+0200",
        "workflow_internal_validation_workflow_id": "visa_conge:1:f5ead0bf-5ed0-11ef-8122-0242ac150004"
      },
      "externalState": null,
      "state": "DRAFT",
      "readByUserIds": [],
      "workflowIndex": 0,
      "stepIndex": null,
      "visibility": "PUBLIC",
      "originGroup": "Direction du développement",
      "finalGroup": "Direction du développement"
    },
    {
      "id": "cc728704-5ed4-11ef-8122-0242ac150004",
      "legacyId": null,
      "instanceId": "cc71c390-5ed4-11ef-8122-0242ac150004",
      "instanceName": "Ma demande de congé",
      "expectedAction": "START",
      "performedAction": null,
      "notificationType": null,
      "beginDate": "2024-08-20T09:15:52.786+00:00",
      "dueDate": null,
      "date": null,
      "candidateGroups": [
        "Direction du développement"
      ],
      "notifiedGroups": null,
      "mandatoryValidationMetadata": null,
      "mandatoryRejectionMetadata": null,
      "assignee": null,
      "delegatedByGroupId": null,
      "pending": false,
      "variables": {
        "i_Parapheur_internal_creation_date": "2024-08-20T11:15:52.785+0200",
        "workflow_internal_validation_workflow_id": "visa_conge:1:f5ead0bf-5ed0-11ef-8122-0242ac150004"
      },
      "externalState": null,
      "state": "DRAFT",
      "readByUserIds": [],
      "workflowIndex": 0,
      "stepIndex": null,
      "visibility": "PUBLIC",
      "originGroup": "Direction du développement",
      "finalGroup": "Direction du développement"
    },
    {
      "id": "d5c9e2aa-5ed4-11ef-8122-0242ac150004",
      "legacyId": null,
      "instanceId": "d5c99466-5ed4-11ef-8122-0242ac150004",
      "instanceName": "Ma demande de congé",
      "expectedAction": "START",
      "performedAction": null,
      "notificationType": null,
      "beginDate": "2024-08-20T09:16:08.461+00:00",
      "dueDate": null,
      "date": null,
      "candidateGroups": [
        "Direction du développement"
      ],
      "notifiedGroups": null,
      "mandatoryValidationMetadata": null,
      "mandatoryRejectionMetadata": null,
      "assignee": null,
      "delegatedByGroupId": null,
      "pending": false,
      "variables": {
        "i_Parapheur_internal_creation_date": "2024-08-20T11:16:08.461+0200",
        "workflow_internal_validation_workflow_id": "visa_conge:1:f5ead0bf-5ed0-11ef-8122-0242ac150004"
      },
      "externalState": null,
      "state": "DRAFT",
      "readByUserIds": [],
      "workflowIndex": 0,
      "stepIndex": null,
      "visibility": "PUBLIC",
      "originGroup": "Direction du développement",
      "finalGroup": "Direction du développement"
    },
    {
      "id": "de9ddd80-5ed4-11ef-8122-0242ac150004",
      "legacyId": null,
      "instanceId": "de9d8f3c-5ed4-11ef-8122-0242ac150004",
      "instanceName": "Ma demande de congé",
      "expectedAction": "START",
      "performedAction": null,
      "notificationType": null,
      "beginDate": "2024-08-20T09:16:23.272+00:00",
      "dueDate": null,
      "date": null,
      "candidateGroups": [
        "Direction du développement"
      ],
      "notifiedGroups": null,
      "mandatoryValidationMetadata": null,
      "mandatoryRejectionMetadata": null,
      "assignee": null,
      "delegatedByGroupId": null,
      "pending": false,
      "variables": {
        "i_Parapheur_internal_creation_date": "2024-08-20T11:16:23.272+0200",
        "workflow_internal_validation_workflow_id": "visa_conge:1:f5ead0bf-5ed0-11ef-8122-0242ac150004"
      },
      "externalState": null,
      "state": "DRAFT",
      "readByUserIds": [],
      "workflowIndex": 0,
      "stepIndex": null,
      "visibility": "PUBLIC",
      "originGroup": "Direction du développement",
      "finalGroup": "Direction du développement"
    },
    {
      "id": "ea661116-5ed4-11ef-8122-0242ac150004",
      "legacyId": null,
      "instanceId": "ea659cc2-5ed4-11ef-8122-0242ac150004",
      "instanceName": "Ma demande de congé",
      "expectedAction": "START",
      "performedAction": null,
      "notificationType": null,
      "beginDate": "2024-08-20T09:16:43.038+00:00",
      "dueDate": null,
      "date": null,
      "candidateGroups": [
        "Direction du développement"
      ],
      "notifiedGroups": null,
      "mandatoryValidationMetadata": null,
      "mandatoryRejectionMetadata": null,
      "assignee": null,
      "delegatedByGroupId": null,
      "pending": false,
      "variables": {
        "i_Parapheur_internal_creation_date": "2024-08-20T11:16:43.038+0200",
        "workflow_internal_validation_workflow_id": "visa_conge:1:f5ead0bf-5ed0-11ef-8122-0242ac150004"
      },
      "externalState": null,
      "state": "DRAFT",
      "readByUserIds": [],
      "workflowIndex": 0,
      "stepIndex": null,
      "visibility": "PUBLIC",
      "originGroup": "Direction du développement",
      "finalGroup": "Direction du développement"
    },
    {
      "id": "ebcd775c-5ed9-11ef-8122-0242ac150004",
      "legacyId": null,
      "instanceId": "ebcd2918-5ed9-11ef-8122-0242ac150004",
      "instanceName": "Ma demande de congé",
      "expectedAction": "START",
      "performedAction": null,
      "notificationType": null,
      "beginDate": "2024-08-20T09:52:32.878+00:00",
      "dueDate": null,
      "date": null,
      "candidateGroups": [
        "Direction du développement"
      ],
      "notifiedGroups": null,
      "mandatoryValidationMetadata": null,
      "mandatoryRejectionMetadata": null,
      "assignee": null,
      "delegatedByGroupId": null,
      "pending": false,
      "variables": {
        "i_Parapheur_internal_creation_date": "2024-08-20T11:52:32.877+0200",
        "workflow_internal_validation_workflow_id": "visa_conge:1:f5ead0bf-5ed0-11ef-8122-0242ac150004"
      },
      "externalState": null,
      "state": "DRAFT",
      "readByUserIds": [],
      "workflowIndex": 0,
      "stepIndex": null,
      "visibility": "PUBLIC",
      "originGroup": "Direction du développement",
      "finalGroup": "Direction du développement"
    },
    {
      "id": "fa58b57c-5ed4-11ef-8122-0242ac150004",
      "legacyId": null,
      "instanceId": "fa586738-5ed4-11ef-8122-0242ac150004",
      "instanceName": "Ma demande de congé",
      "expectedAction": "START",
      "performedAction": null,
      "notificationType": null,
      "beginDate": "2024-08-20T09:17:09.795+00:00",
      "dueDate": null,
      "date": null,
      "candidateGroups": [
        "Direction du développement"
      ],
      "notifiedGroups": null,
      "mandatoryValidationMetadata": null,
      "mandatoryRejectionMetadata": null,
      "assignee": null,
      "delegatedByGroupId": null,
      "pending": false,
      "variables": {
        "i_Parapheur_internal_creation_date": "2024-08-20T11:17:09.795+0200",
        "workflow_internal_validation_workflow_id": "visa_conge:1:f5ead0bf-5ed0-11ef-8122-0242ac150004"
      },
      "externalState": null,
      "state": "DRAFT",
      "readByUserIds": [],
      "workflowIndex": 0,
      "stepIndex": null,
      "visibility": "PUBLIC",
      "originGroup": "Direction du développement",
      "finalGroup": "Direction du développement"
    },
    {
      "id": "1da7eb28-5eda-11ef-8122-0242ac150004",
      "legacyId": null,
      "instanceId": "1da79ce4-5eda-11ef-8122-0242ac150004",
      "instanceName": "Ma demande de congé 2222",
      "expectedAction": "START",
      "performedAction": null,
      "notificationType": null,
      "beginDate": "2024-08-20T09:53:56.518+00:00",
      "dueDate": null,
      "date": null,
      "candidateGroups": [
        "Direction du développement"
      ],
      "notifiedGroups": null,
      "mandatoryValidationMetadata": null,
      "mandatoryRejectionMetadata": null,
      "assignee": null,
      "delegatedByGroupId": null,
      "pending": false,
      "variables": {
        "i_Parapheur_internal_creation_date": "2024-08-20T11:53:56.518+0200",
        "workflow_internal_validation_workflow_id": "visa_conge:1:f5ead0bf-5ed0-11ef-8122-0242ac150004"
      },
      "externalState": null,
      "state": "DRAFT",
      "readByUserIds": [],
      "workflowIndex": 0,
      "stepIndex": null,
      "visibility": "PUBLIC",
      "originGroup": "Direction du développement",
      "finalGroup": "Direction du développement"
    },
    {
      "id": "5b4f0010-5eda-11ef-8122-0242ac150004",
      "legacyId": null,
      "instanceId": "5b4e8aba-5eda-11ef-8122-0242ac150004",
      "instanceName": "Ma demande de congé 2222",
      "expectedAction": "START",
      "performedAction": null,
      "notificationType": null,
      "beginDate": "2024-08-20T09:55:39.953+00:00",
      "dueDate": null,
      "date": null,
      "candidateGroups": [
        "Direction du développement"
      ],
      "notifiedGroups": null,
      "mandatoryValidationMetadata": null,
      "mandatoryRejectionMetadata": null,
      "assignee": null,
      "delegatedByGroupId": null,
      "pending": false,
      "variables": {
        "i_Parapheur_internal_creation_date": "2024-08-20root@c6674ff37517:/app#
